{"text_format":"1","workbook":"xlsx","n_sheets":5,"sheets":["Sheet1","Sheet2","Sheet3","Sheet4","Sheet5"],"not_rendered":{"charts":0,"images":0,"macros":0,"external_links":1,"defined_names":2,"comments":0,"pivot_tables":0},"unopened":[],"bounds":{"document_bytes":16777216,"sheet_cells":100000,"rows_first":2000,"rows_last":500,"rows_between":2000,"halvings":0,"cell_chars":16384,"cell_head_chars":4096},"cells_cut":0,"cells_raw":0,"read":"whole","date_system":"1900"}

{"sheet":"Sheet1","index":0,"n_rows":18,"n_cols":9,"rows_kept":18,"cut":false,"hidden":false,"merged":[]}
[710,41750,"710&41750","J","J (133% I)","J (133% I) [$31,313]","MCDU","50000, 47000","Boeing 747, Wide body VIP, A330, A300, A340, Boeing 767, McDonnell Douglas MD-11, Airbus A300"]
[null,null,null,"J1",null,null,null,null,"A350, Boeing 777, Boeing 777X, Boeing 787"]
[713,11206,"713&11206","C",null,"","A/T Engine Control Unit","34000, 13500","Boeing 747, Wide body VIP, A330, A340"]
[null,null,null,"C1",null,null,null,null,"Boeing 777, A350, Boeing 787"]
[721,10638,"721&10638","E",null,"","Air Data Modules (ADM)","13500, 17000, 23000","ACJ, BBJ, Wide body VIP, A330, A350, Boeing 777X, A340, A320ceo, Boeing 737, Boeing 737NG, Boeing 757, A220, A320neo, Boeing 717, Boeing 737 Classic, Boeing 737MAX, Boeing New Single Aisle (NSA), Comac C919, Irkut MC-21, Airbus A300, Boeing 767, Boeing 777, Boeing 787, A380, Boeing 747, B-52 Stratofortress, Boeing P-8 Poseidon, Boeing C-40 Clipper "]
[721,26597,"721&26597","P","P (120%O)","P (120%O) [$22,341]","Air Data Modules (ADM)","34000, 29746.1635642517","Challenger 600 series, Challenger 850, Citation Hemisphere, Citation Longitude, Falcon 10X, Falcon 6X, Falcon 7X/8X, Falcon 900, G450, G500/G600, G550, G650, G700, Global 7000, Global Express - 5000/6000, Legacy 600/650, Legacy 700, Lineage 1000, A330 LMXT, A330 MRTT, Boeing KC-46 Pegasus, C-17, C-5, Embraer KC-390, Kawasaki C-2, Kawasaki P-1, A400M Atlas, Alenia C-27J, C-130J, CASA C-212 Aviocar, CASA/IPTN CN-235, E-2, EADS CASA C-295, ShinMaywa US-2, Boeing KC-135 Stratotanker, McDonnell Douglas KC-10"]
[722,10999,"722&10999","G",null,"","Air data probes (pitot/static)","12000, 9000","Challenger 600 series, Challenger 850, Citation Hemisphere, Citation Longitude, Falcon 10X, Falcon 6X, Falcon 7X/8X, Falcon 900, G450, G500/G600, G550, G650, G700, Global 7000, Global Express - 5000/6000, Legacy 600/650, Legacy 700, Lineage 1000, Wide body VIP, A330, A350, Boeing 747, Boeing 777X, A300, A340, Boeing 767, McDonnell Douglas MD-11, Airbus A300, Boeing 777"]
[722,13200,"722&13200","I",null,"","Air data probes (pitot/static)","14000, 14762.9190904283","Boeing 747, Wide body VIP, Boeing 777, A350, Boeing 777X, Boeing 787, A330 LMXT, A330 MRTT, Boeing KC-46 Pegasus, C-17, C-5, Embraer KC-390, Kawasaki C-2, Kawasaki P-1, A400M Atlas, Alenia C-27J, C-130J, CASA C-212 Aviocar, CASA/IPTN CN-235, E-2, EADS CASA C-295, ShinMaywa US-2, Boeing KC-135 Stratotanker, McDonnell Douglas KC-10"]
[723,44327,"723&44327","D",null,"","Multi Mode Receiver (MMR)","56000, 45000, 49575.4480698043","ACJ, BBJ, Boeing 747, Wide body VIP, A330, A350, Boeing 777, Boeing 777X, A300, A340, Boeing 767, McDonnell Douglas MD-11, A320ceo, Boeing 737, Boeing 737NG, Boeing 757, A220, A320neo, Boeing 717, Boeing 737 Classic, Boeing 737MAX, Boeing New Single Aisle (NSA), Comac C919, Irkut MC-21, Airbus A300, Boeing 787, A380, A330 LMXT, A330 MRTT, Boeing KC-46 Pegasus, C-17, C-5, Embraer KC-390, Kawasaki C-2, Kawasaki P-1, A400M Atlas, Alenia C-27J, C-130J, CASA C-212 Aviocar, CASA/IPTN CN-235, E-2, EADS CASA C-295, ShinMaywa US-2, Boeing KC-135 Stratotanker, McDonnell Douglas KC-10"]
[749,0,"749&0","A",null,"","TCAS computer","17000, 20131.2533051296, 21000"]
[752,19569,"752&19569","J",null,"","Cockpit Voice Recorder","25000, 22000","ACJ, BBJ, Boeing 747, Wide body VIP, Boeing 777, A320ceo, Boeing 737, Boeing 737NG, Boeing 757, A220, A320neo, Boeing 717, Boeing 737 Classic, Boeing 737MAX, Boeing New Single Aisle (NSA), Comac C919, A350, Boeing 777X, Boeing 787"]
[755,9205,"755&9205","C",null,"","FD Interface Unit","10000, 11000","ACJ, BBJ, Boeing 747, Wide body VIP, Boeing 777, A320ceo, Boeing 737, Boeing 737NG, Boeing 757, A220, A320neo, Boeing 717, Boeing 737 Classic, Boeing 737MAX, Boeing New Single Aisle (NSA), Comac C919, Irkut MC-21, A350, Boeing 777X, Boeing 787, B-52 Stratofortress, Boeing P-8 Poseidon, Boeing C-40 Clipper "]
[764,15958,"764&15958","F",null,"","Radar altimeters","17000, 17847.4744579588, 21000","Wide body VIP, A330, A350, Boeing 747, Boeing 777X, A300, A340, Boeing 767, McDonnell Douglas MD-11, Airbus A300, Boeing 777, A330 LMXT, A330 MRTT, Boeing KC-46 Pegasus, C-17, C-5, Embraer KC-390, Kawasaki C-2, Kawasaki P-1, A400M Atlas, Alenia C-27J, C-130J, CASA C-212 Aviocar, CASA/IPTN CN-235, E-2, EADS CASA C-295, ShinMaywa US-2, Boeing KC-135 Stratotanker, McDonnell Douglas KC-10, Bombardier CRJ, Comac ARJ21, Embraer E170/190, ERJ 135/140/145, Sukhoi Superjet, ATR 42/72, ATR 42/72X, AVIC MA700, De Havilland Canada DHC-8, Dornier Do 328-100, Embraer , Xian MA60, Canadair CL-415"]
[764,17731,"764&17731","H",null,"","Radar altimeters","19830.402908514, 23000","Challenger 600 series, Challenger 850, Citation Hemisphere, Citation Longitude, Falcon 10X, Falcon 6X, Falcon 7X/8X, Falcon 900, G450, G500/G600, G550, G650, G700, Global 7000, Global Express - 5000/6000, Legacy 600/650, Legacy 700, Lineage 1000, Aero L-39NG, AIDC T-5, FMA IA 63 Pampa, Hawk, HJT-36 Sitara, Hongdu K-8, M-345, M-346, T-45, Tejas"]
[795,111607,"795&111607","A",null,"","Mission computers","111607, 124821.599312533","Aero L-39NG, AIDC T-5, FMA IA 63 Pampa, Hawk, HJT-36 Sitara, Hongdu K-8, M-345, M-346, T-45, Tejas, AH-1, AH-64, AW 249, Future Attack Reconnaissance Aircraft, TAI/Leonardo T129, Tiger, V-22, WAH-64, Airbus UH-72 Lakota, CH-47, HAL Dhruv, HAL Light Utility Helicopter, HAL Medium Lift, KAI KUH-1 Surion, Kawasaki OH-1, Leonardo AW101, Leonardo AW159 Lynx, MH139, NH90, OH-58, SH-60, Sikorsky CH-53K King Stallion, TAI T625, UH-1, UH-60, X6, KAI KT-1 Woongbi, TAI Hürkus, Beechcraft T-6 Texan II, Grob G 120TP, HHT-40, Other Turboprop trainers/light attack, PC-7, PC-9, Tucano"]
[825,37353,"825&37353","F",null,"","Auto pilot system","42000, 41775.705817028","Challenger 600 series, Challenger 850, Citation Hemisphere, Citation Longitude, Falcon 10X, Falcon 6X, Falcon 7X/8X, Falcon 900, G450, G500/G600, G550, G650, G700, Global 7000, Global Express - 5000/6000, Legacy 600/650, Legacy 700, Lineage 1000, Other CUAV, Bayraktar TB-2, MQ-4C Triton, MQ-9 Reaper, Other MALE/HALE, RQ-4A Global Hawk, Other TUAV, RQ-7 Shadow, MQ-8, Other VTUAV"]
[847,25303,"847&25303","G",null,"","Engine/fuel/ displays","29000, 25303","AH-1, AH-64, AW 249, Future Attack Reconnaissance Aircraft, TAI/Leonardo T129, Tiger, V-22, WAH-64, Airbus UH-72 Lakota, CH-47, H175, H215 / H225, Leonardo AW169, Leonardo AW189, Leonardo AW609, NH90, OH-58, S-76, S-92, SH-60, Sikorsky CH-53K King Stallion, TAI T625, UH-1, UH-60, X6"]
[878,82497,"878&82497","G","G (133% F)","G (133% F) [$61,873]","Sensors IFF, other","92264.889106293, 93000","Challenger 600 series, Challenger 850, Citation Hemisphere, Citation Longitude, Falcon 10X, Falcon 6X, Falcon 7X/8X, Falcon 900, G450, G500/G600, G550, G650, G700, Global 7000, Global Express - 5000/6000, Legacy 600/650, Legacy 700, Lineage 1000, Aero L-39NG, AIDC T-5, FMA IA 63 Pampa, Hawk, HJT-36 Sitara, Hongdu K-8, M-345, M-346, T-45, Tejas"]

{"sheet":"Sheet2","index":1,"n_rows":140,"n_cols":3,"rows_kept":140,"cut":false,"hidden":false,"merged":[]}
[{"$f":"INDEX('[1]Pt1-AvionicsComponentCosts'!$A:$C,MATCH(C1,'[1]Pt1-AvionicsComponentCosts'!$D:$D,0),1)","v":594},{"$f":"INDEX('[1]Pt1-AvionicsComponentCosts'!$A:$C,MATCH(C1,'[1]Pt1-AvionicsComponentCosts'!$D:$D,0),2)","v":"Business Jet"},"Boeing 747"]
[{"$f":"INDEX('[1]Pt1-AvionicsComponentCosts'!$A:$C,MATCH(C2,'[1]Pt1-AvionicsComponentCosts'!$D:$D,0),1)","v":678},{"$f":"INDEX('[1]Pt1-AvionicsComponentCosts'!$A:$C,MATCH(C2,'[1]Pt1-AvionicsComponentCosts'!$D:$D,0),2)","v":"Business Jet"},"Wide body VIP"]
[{"$f":"INDEX('[1]Pt1-AvionicsComponentCosts'!$A:$C,MATCH(C3,'[1]Pt1-AvionicsComponentCosts'!$D:$D,0),1)","v":565},{"$f":"INDEX('[1]Pt1-AvionicsComponentCosts'!$A:$C,MATCH(C3,'[1]Pt1-AvionicsComponentCosts'!$D:$D,0),2)","v":"Freighter"},"A330"]
[{"$f":"INDEX('[1]Pt1-AvionicsComponentCosts'!$A:$C,MATCH(C4,'[1]Pt1-AvionicsComponentCosts'!$D:$D,0),1)","v":632},{"$f":"INDEX('[1]Pt1-AvionicsComponentCosts'!$A:$C,MATCH(C4,'[1]Pt1-AvionicsComponentCosts'!$D:$D,0),2)","v":"Freighter"},"A300"]
[{"$f":"INDEX('[1]Pt1-AvionicsComponentCosts'!$A:$C,MATCH(C5,'[1]Pt1-AvionicsComponentCosts'!$D:$D,0),1)","v":669},{"$f":"INDEX('[1]Pt1-AvionicsComponentCosts'!$A:$C,MATCH(C5,'[1]Pt1-AvionicsComponentCosts'!$D:$D,0),2)","v":"Freighter"},"A340"]
[{"$f":"INDEX('[1]Pt1-AvionicsComponentCosts'!$A:$C,MATCH(C6,'[1]Pt1-AvionicsComponentCosts'!$D:$D,0),1)","v":570},{"$f":"INDEX('[1]Pt1-AvionicsComponentCosts'!$A:$C,MATCH(C6,'[1]Pt1-AvionicsComponentCosts'!$D:$D,0),2)","v":"Freighter"},"Boeing 767"]
[{"$f":"INDEX('[1]Pt1-AvionicsComponentCosts'!$A:$C,MATCH(C7,'[1]Pt1-AvionicsComponentCosts'!$D:$D,0),1)","v":627},{"$f":"INDEX('[1]Pt1-AvionicsComponentCosts'!$A:$C,MATCH(C7,'[1]Pt1-AvionicsComponentCosts'!$D:$D,0),2)","v":"Freighter"},"McDonnell Douglas MD-11"]
[{"$f":"INDEX('[1]Pt1-AvionicsComponentCosts'!$A:$C,MATCH(C8,'[1]Pt1-AvionicsComponentCosts'!$D:$D,0),1)","v":305},{"$f":"INDEX('[1]Pt1-AvionicsComponentCosts'!$A:$C,MATCH(C8,'[1]Pt1-AvionicsComponentCosts'!$D:$D,0),2)","v":"Large Commercial Aircraft"},"Airbus A300"]
[{"$f":"INDEX('[1]Pt1-AvionicsComponentCosts'!$A:$C,MATCH(C9,'[1]Pt1-AvionicsComponentCosts'!$D:$D,0),1)","v":644},{"$f":"INDEX('[1]Pt1-AvionicsComponentCosts'!$A:$C,MATCH(C9,'[1]Pt1-AvionicsComponentCosts'!$D:$D,0),2)","v":"Freighter"},"A350"]
[{"$f":"INDEX('[1]Pt1-AvionicsComponentCosts'!$A:$C,MATCH(C10,'[1]Pt1-AvionicsComponentCosts'!$D:$D,0),1)","v":664},{"$f":"INDEX('[1]Pt1-AvionicsComponentCosts'!$A:$C,MATCH(C10,'[1]Pt1-AvionicsComponentCosts'!$D:$D,0),2)","v":"Freighter"},"Boeing 777"]
[{"$f":"INDEX('[1]Pt1-AvionicsComponentCosts'!$A:$C,MATCH(C11,'[1]Pt1-AvionicsComponentCosts'!$D:$D,0),1)","v":659},{"$f":"INDEX('[1]Pt1-AvionicsComponentCosts'!$A:$C,MATCH(C11,'[1]Pt1-AvionicsComponentCosts'!$D:$D,0),2)","v":"Freighter"},"Boeing 777X"]
[{"$f":"INDEX('[1]Pt1-AvionicsComponentCosts'!$A:$C,MATCH(C12,'[1]Pt1-AvionicsComponentCosts'!$D:$D,0),1)","v":200},{"$f":"INDEX('[1]Pt1-AvionicsComponentCosts'!$A:$C,MATCH(C12,'[1]Pt1-AvionicsComponentCosts'!$D:$D,0),2)","v":"Large Commercial Aircraft"},"Boeing 787"]
[{"$f":"INDEX('[1]Pt1-AvionicsComponentCosts'!$A:$C,MATCH(C13,'[1]Pt1-AvionicsComponentCosts'!$D:$D,0),1)","v":674},{"$f":"INDEX('[1]Pt1-AvionicsComponentCosts'!$A:$C,MATCH(C13,'[1]Pt1-AvionicsComponentCosts'!$D:$D,0),2)","v":"Business Jet"},"ACJ"]
[{"$f":"INDEX('[1]Pt1-AvionicsComponentCosts'!$A:$C,MATCH(C14,'[1]Pt1-AvionicsComponentCosts'!$D:$D,0),1)","v":529},{"$f":"INDEX('[1]Pt1-AvionicsComponentCosts'!$A:$C,MATCH(C14,'[1]Pt1-AvionicsComponentCosts'!$D:$D,0),2)","v":"Business Jet"},"BBJ"]
[{"$f":"INDEX('[1]Pt1-AvionicsComponentCosts'!$A:$C,MATCH(C15,'[1]Pt1-AvionicsComponentCosts'!$D:$D,0),1)","v":665},{"$f":"INDEX('[1]Pt1-AvionicsComponentCosts'!$A:$C,MATCH(C15,'[1]Pt1-AvionicsComponentCosts'!$D:$D,0),2)","v":"Freighter"},"A320ceo"]
[{"$f":"INDEX('[1]Pt1-AvionicsComponentCosts'!$A:$C,MATCH(C16,'[1]Pt1-AvionicsComponentCosts'!$D:$D,0),1)","v":573},{"$f":"INDEX('[1]Pt1-AvionicsComponentCosts'!$A:$C,MATCH(C16,'[1]Pt1-AvionicsComponentCosts'!$D:$D,0),2)","v":"Freighter"},"Boeing 737"]
[{"$f":"INDEX('[1]Pt1-AvionicsComponentCosts'!$A:$C,MATCH(C17,'[1]Pt1-AvionicsComponentCosts'!$D:$D,0),1)","v":571},{"$f":"INDEX('[1]Pt1-AvionicsComponentCosts'!$A:$C,MATCH(C17,'[1]Pt1-AvionicsComponentCosts'!$D:$D,0),2)","v":"Freighter"},"Boeing 737NG"]
[{"$f":"INDEX('[1]Pt1-AvionicsComponentCosts'!$A:$C,MATCH(C18,'[1]Pt1-AvionicsComponentCosts'!$D:$D,0),1)","v":596},{"$f":"INDEX('[1]Pt1-AvionicsComponentCosts'!$A:$C,MATCH(C18,'[1]Pt1-AvionicsComponentCosts'!$D:$D,0),2)","v":"Freighter"},"Boeing 757"]
[{"$f":"INDEX('[1]Pt1-AvionicsComponentCosts'!$A:$C,MATCH(C19,'[1]Pt1-AvionicsComponentCosts'!$D:$D,0),1)","v":221},{"$f":"INDEX('[1]Pt1-AvionicsComponentCosts'!$A:$C,MATCH(C19,'[1]Pt1-AvionicsComponentCosts'!$D:$D,0),2)","v":"Large Commercial Aircraft"},"A220"]
[{"$f":"INDEX('[1]Pt1-AvionicsComponentCosts'!$A:$C,MATCH(C20,'[1]Pt1-AvionicsComponentCosts'!$D:$D,0),1)","v":513},{"$f":"INDEX('[1]Pt1-AvionicsComponentCosts'!$A:$C,MATCH(C20,'[1]Pt1-AvionicsComponentCosts'!$D:$D,0),2)","v":"Large Commercial Aircraft"},"A320neo"]
[{"$f":"INDEX('[1]Pt1-AvionicsComponentCosts'!$A:$C,MATCH(C21,'[1]Pt1-AvionicsComponentCosts'!$D:$D,0),1)","v":299},{"$f":"INDEX('[1]Pt1-AvionicsComponentCosts'!$A:$C,MATCH(C21,'[1]Pt1-AvionicsComponentCosts'!$D:$D,0),2)","v":"Large Commercial Aircraft"},"Boeing 717"]
[{"$f":"INDEX('[1]Pt1-AvionicsComponentCosts'!$A:$C,MATCH(C22,'[1]Pt1-AvionicsComponentCosts'!$D:$D,0),1)","v":534},{"$f":"INDEX('[1]Pt1-AvionicsComponentCosts'!$A:$C,MATCH(C22,'[1]Pt1-AvionicsComponentCosts'!$D:$D,0),2)","v":"Large Commercial Aircraft"},"Boeing 737 Classic"]
[{"$f":"INDEX('[1]Pt1-AvionicsComponentCosts'!$A:$C,MATCH(C23,'[1]Pt1-AvionicsComponentCosts'!$D:$D,0),1)","v":309},{"$f":"INDEX('[1]Pt1-AvionicsComponentCosts'!$A:$C,MATCH(C23,'[1]Pt1-AvionicsComponentCosts'!$D:$D,0),2)","v":"Large Commercial Aircraft"},"Boeing 737MAX"]
[{"$f":"INDEX('[1]Pt1-AvionicsComponentCosts'!$A:$C,MATCH(C24,'[1]Pt1-AvionicsComponentCosts'!$D:$D,0),1)","v":612},{"$f":"INDEX('[1]Pt1-AvionicsComponentCosts'!$A:$C,MATCH(C24,'[1]Pt1-AvionicsComponentCosts'!$D:$D,0),2)","v":"Large Commercial Aircraft"},"Boeing New Single Aisle (NSA)"]
[{"$f":"INDEX('[1]Pt1-AvionicsComponentCosts'!$A:$C,MATCH(C25,'[1]Pt1-AvionicsComponentCosts'!$D:$D,0),1)","v":18},{"$f":"INDEX('[1]Pt1-AvionicsComponentCosts'!$A:$C,MATCH(C25,'[1]Pt1-AvionicsComponentCosts'!$D:$D,0),2)","v":"Large Commercial Aircraft"},"Comac C919"]
[{"$f":"INDEX('[1]Pt1-AvionicsComponentCosts'!$A:$C,MATCH(C26,'[1]Pt1-AvionicsComponentCosts'!$D:$D,0),1)","v":541},{"$f":"INDEX('[1]Pt1-AvionicsComponentCosts'!$A:$C,MATCH(C26,'[1]Pt1-AvionicsComponentCosts'!$D:$D,0),2)","v":"Large Commercial Aircraft"},"Irkut MC-21"]
[{"$f":"INDEX('[1]Pt1-AvionicsComponentCosts'!$A:$C,MATCH(C27,'[1]Pt1-AvionicsComponentCosts'!$D:$D,0),1)","v":216},{"$f":"INDEX('[1]Pt1-AvionicsComponentCosts'!$A:$C,MATCH(C27,'[1]Pt1-AvionicsComponentCosts'!$D:$D,0),2)","v":"Large Commercial Aircraft"},"A380"]
[{"$f":"INDEX('[1]Pt1-AvionicsComponentCosts'!$A:$C,MATCH(C28,'[1]Pt1-AvionicsComponentCosts'!$D:$D,0),1)","v":636},{"$f":"INDEX('[1]Pt1-AvionicsComponentCosts'!$A:$C,MATCH(C28,'[1]Pt1-AvionicsComponentCosts'!$D:$D,0),2)","v":"Military Transport / Special Mission"},"B-52 Stratofortress"]
[{"$f":"INDEX('[1]Pt1-AvionicsComponentCosts'!$A:$C,MATCH(C29,'[1]Pt1-AvionicsComponentCosts'!$D:$D,0),1)","v":156},{"$f":"INDEX('[1]Pt1-AvionicsComponentCosts'!$A:$C,MATCH(C29,'[1]Pt1-AvionicsComponentCosts'!$D:$D,0),2)","v":"Military Transport / Special Mission"},"Boeing P-8 Poseidon"]
[{"$f":"INDEX('[1]Pt1-AvionicsComponentCosts'!$A:$C,MATCH(C30,'[1]Pt1-AvionicsComponentCosts'!$D:$D,0),1)","v":574},{"$f":"INDEX('[1]Pt1-AvionicsComponentCosts'!$A:$C,MATCH(C30,'[1]Pt1-AvionicsComponentCosts'!$D:$D,0),2)","v":"Military Transport / Special Mission"},"Boeing C-40 Clipper "]
[{"$f":"INDEX('[1]Pt1-AvionicsComponentCosts'!$A:$C,MATCH(C31,'[1]Pt1-AvionicsComponentCosts'!$D:$D,0),1)","v":35},{"$f":"INDEX('[1]Pt1-AvionicsComponentCosts'!$A:$C,MATCH(C31,'[1]Pt1-AvionicsComponentCosts'!$D:$D,0),2)","v":"Business Jet"},"Challenger 600 series"]
[{"$f":"INDEX('[1]Pt1-AvionicsComponentCosts'!$A:$C,MATCH(C32,'[1]Pt1-AvionicsComponentCosts'!$D:$D,0),1)","v":72},{"$f":"INDEX('[1]Pt1-AvionicsComponentCosts'!$A:$C,MATCH(C32,'[1]Pt1-AvionicsComponentCosts'!$D:$D,0),2)","v":"Business Jet"},"Challenger 850"]
[{"$f":"INDEX('[1]Pt1-AvionicsComponentCosts'!$A:$C,MATCH(C33,'[1]Pt1-AvionicsComponentCosts'!$D:$D,0),1)","v":48},{"$f":"INDEX('[1]Pt1-AvionicsComponentCosts'!$A:$C,MATCH(C33,'[1]Pt1-AvionicsComponentCosts'!$D:$D,0),2)","v":"Business Jet"},"Citation Hemisphere"]
[{"$f":"INDEX('[1]Pt1-AvionicsComponentCosts'!$A:$C,MATCH(C34,'[1]Pt1-AvionicsComponentCosts'!$D:$D,0),1)","v":47},{"$f":"INDEX('[1]Pt1-AvionicsComponentCosts'!$A:$C,MATCH(C34,'[1]Pt1-AvionicsComponentCosts'!$D:$D,0),2)","v":"Business Jet"},"Citation Longitude"]
[{"$f":"INDEX('[1]Pt1-AvionicsComponentCosts'!$A:$C,MATCH(C35,'[1]Pt1-AvionicsComponentCosts'!$D:$D,0),1)","v":587},{"$f":"INDEX('[1]Pt1-AvionicsComponentCosts'!$A:$C,MATCH(C35,'[1]Pt1-AvionicsComponentCosts'!$D:$D,0),2)","v":"Business Jet"},"Falcon 10X"]
[{"$f":"INDEX('[1]Pt1-AvionicsComponentCosts'!$A:$C,MATCH(C36,'[1]Pt1-AvionicsComponentCosts'!$D:$D,0),1)","v":51},{"$f":"INDEX('[1]Pt1-AvionicsComponentCosts'!$A:$C,MATCH(C36,'[1]Pt1-AvionicsComponentCosts'!$D:$D,0),2)","v":"Business Jet"},"Falcon 6X"]
[{"$f":"INDEX('[1]Pt1-AvionicsComponentCosts'!$A:$C,MATCH(C37,'[1]Pt1-AvionicsComponentCosts'!$D:$D,0),1)","v":54},{"$f":"INDEX('[1]Pt1-AvionicsComponentCosts'!$A:$C,MATCH(C37,'[1]Pt1-AvionicsComponentCosts'!$D:$D,0),2)","v":"Business Jet"},"Falcon 7X/8X"]
[{"$f":"INDEX('[1]Pt1-AvionicsComponentCosts'!$A:$C,MATCH(C38,'[1]Pt1-AvionicsComponentCosts'!$D:$D,0),1)","v":50},{"$f":"INDEX('[1]Pt1-AvionicsComponentCosts'!$A:$C,MATCH(C38,'[1]Pt1-AvionicsComponentCosts'!$D:$D,0),2)","v":"Business Jet"},"Falcon 900"]
[{"$f":"INDEX('[1]Pt1-AvionicsComponentCosts'!$A:$C,MATCH(C39,'[1]Pt1-AvionicsComponentCosts'!$D:$D,0),1)","v":59},{"$f":"INDEX('[1]Pt1-AvionicsComponentCosts'!$A:$C,MATCH(C39,'[1]Pt1-AvionicsComponentCosts'!$D:$D,0),2)","v":"Business Jet"},"G450"]
[{"$f":"INDEX('[1]Pt1-AvionicsComponentCosts'!$A:$C,MATCH(C40,'[1]Pt1-AvionicsComponentCosts'!$D:$D,0),1)","v":61},{"$f":"INDEX('[1]Pt1-AvionicsComponentCosts'!$A:$C,MATCH(C40,'[1]Pt1-AvionicsComponentCosts'!$D:$D,0),2)","v":"Business Jet"},"G500/G600"]
[{"$f":"INDEX('[1]Pt1-AvionicsComponentCosts'!$A:$C,MATCH(C41,'[1]Pt1-AvionicsComponentCosts'!$D:$D,0),1)","v":60},{"$f":"INDEX('[1]Pt1-AvionicsComponentCosts'!$A:$C,MATCH(C41,'[1]Pt1-AvionicsComponentCosts'!$D:$D,0),2)","v":"Business Jet"},"G550"]
[{"$f":"INDEX('[1]Pt1-AvionicsComponentCosts'!$A:$C,MATCH(C42,'[1]Pt1-AvionicsComponentCosts'!$D:$D,0),1)","v":63},{"$f":"INDEX('[1]Pt1-AvionicsComponentCosts'!$A:$C,MATCH(C42,'[1]Pt1-AvionicsComponentCosts'!$D:$D,0),2)","v":"Business Jet"},"G650"]
[{"$f":"INDEX('[1]Pt1-AvionicsComponentCosts'!$A:$C,MATCH(C43,'[1]Pt1-AvionicsComponentCosts'!$D:$D,0),1)","v":598},{"$f":"INDEX('[1]Pt1-AvionicsComponentCosts'!$A:$C,MATCH(C43,'[1]Pt1-AvionicsComponentCosts'!$D:$D,0),2)","v":"Business Jet"},"G700"]
[{"$f":"INDEX('[1]Pt1-AvionicsComponentCosts'!$A:$C,MATCH(C44,'[1]Pt1-AvionicsComponentCosts'!$D:$D,0),1)","v":38},{"$f":"INDEX('[1]Pt1-AvionicsComponentCosts'!$A:$C,MATCH(C44,'[1]Pt1-AvionicsComponentCosts'!$D:$D,0),2)","v":"Business Jet"},"Global 7000"]
[{"$f":"INDEX('[1]Pt1-AvionicsComponentCosts'!$A:$C,MATCH(C45,'[1]Pt1-AvionicsComponentCosts'!$D:$D,0),1)","v":36},{"$f":"INDEX('[1]Pt1-AvionicsComponentCosts'!$A:$C,MATCH(C45,'[1]Pt1-AvionicsComponentCosts'!$D:$D,0),2)","v":"Business Jet"},"Global Express - 5000/6000"]
[{"$f":"INDEX('[1]Pt1-AvionicsComponentCosts'!$A:$C,MATCH(C46,'[1]Pt1-AvionicsComponentCosts'!$D:$D,0),1)","v":74},{"$f":"INDEX('[1]Pt1-AvionicsComponentCosts'!$A:$C,MATCH(C46,'[1]Pt1-AvionicsComponentCosts'!$D:$D,0),2)","v":"Business Jet"},"Legacy 600/650"]
[{"$f":"INDEX('[1]Pt1-AvionicsComponentCosts'!$A:$C,MATCH(C47,'[1]Pt1-AvionicsComponentCosts'!$D:$D,0),1)","v":652},{"$f":"INDEX('[1]Pt1-AvionicsComponentCosts'!$A:$C,MATCH(C47,'[1]Pt1-AvionicsComponentCosts'!$D:$D,0),2)","v":"Business Jet"},"Legacy 700"]
[{"$f":"INDEX('[1]Pt1-AvionicsComponentCosts'!$A:$C,MATCH(C48,'[1]Pt1-AvionicsComponentCosts'!$D:$D,0),1)","v":73},{"$f":"INDEX('[1]Pt1-AvionicsComponentCosts'!$A:$C,MATCH(C48,'[1]Pt1-AvionicsComponentCosts'!$D:$D,0),2)","v":"Business Jet"},"Lineage 1000"]
[{"$f":"INDEX('[1]Pt1-AvionicsComponentCosts'!$A:$C,MATCH(C49,'[1]Pt1-AvionicsComponentCosts'!$D:$D,0),1)","v":658},{"$f":"INDEX('[1]Pt1-AvionicsComponentCosts'!$A:$C,MATCH(C49,'[1]Pt1-AvionicsComponentCosts'!$D:$D,0),2)","v":"Military Transport / Special Mission"},"A330 LMXT"]
[{"$f":"INDEX('[1]Pt1-AvionicsComponentCosts'!$A:$C,MATCH(C50,'[1]Pt1-AvionicsComponentCosts'!$D:$D,0),1)","v":551},{"$f":"INDEX('[1]Pt1-AvionicsComponentCosts'!$A:$C,MATCH(C50,'[1]Pt1-AvionicsComponentCosts'!$D:$D,0),2)","v":"Military Transport / Special Mission"},"A330 MRTT"]
[{"$f":"INDEX('[1]Pt1-AvionicsComponentCosts'!$A:$C,MATCH(C51,'[1]Pt1-AvionicsComponentCosts'!$D:$D,0),1)","v":157},{"$f":"INDEX('[1]Pt1-AvionicsComponentCosts'!$A:$C,MATCH(C51,'[1]Pt1-AvionicsComponentCosts'!$D:$D,0),2)","v":"Military Transport / Special Mission"},"Boeing KC-46 Pegasus"]
[{"$f":"INDEX('[1]Pt1-AvionicsComponentCosts'!$A:$C,MATCH(C52,'[1]Pt1-AvionicsComponentCosts'!$D:$D,0),1)","v":158},{"$f":"INDEX('[1]Pt1-AvionicsComponentCosts'!$A:$C,MATCH(C52,'[1]Pt1-AvionicsComponentCosts'!$D:$D,0),2)","v":"Military Transport / Special Mission"},"C-17"]
[{"$f":"INDEX('[1]Pt1-AvionicsComponentCosts'!$A:$C,MATCH(C53,'[1]Pt1-AvionicsComponentCosts'!$D:$D,0),1)","v":163},{"$f":"INDEX('[1]Pt1-AvionicsComponentCosts'!$A:$C,MATCH(C53,'[1]Pt1-AvionicsComponentCosts'!$D:$D,0),2)","v":"Military Transport / Special Mission"},"C-5"]
[{"$f":"INDEX('[1]Pt1-AvionicsComponentCosts'!$A:$C,MATCH(C54,'[1]Pt1-AvionicsComponentCosts'!$D:$D,0),1)","v":159},{"$f":"INDEX('[1]Pt1-AvionicsComponentCosts'!$A:$C,MATCH(C54,'[1]Pt1-AvionicsComponentCosts'!$D:$D,0),2)","v":"Military Transport / Special Mission"},"Embraer KC-390"]
[{"$f":"INDEX('[1]Pt1-AvionicsComponentCosts'!$A:$C,MATCH(C55,'[1]Pt1-AvionicsComponentCosts'!$D:$D,0),1)","v":160},{"$f":"INDEX('[1]Pt1-AvionicsComponentCosts'!$A:$C,MATCH(C55,'[1]Pt1-AvionicsComponentCosts'!$D:$D,0),2)","v":"Military Transport / Special Mission"},"Kawasaki C-2"]
[{"$f":"INDEX('[1]Pt1-AvionicsComponentCosts'!$A:$C,MATCH(C56,'[1]Pt1-AvionicsComponentCosts'!$D:$D,0),1)","v":161},{"$f":"INDEX('[1]Pt1-AvionicsComponentCosts'!$A:$C,MATCH(C56,'[1]Pt1-AvionicsComponentCosts'!$D:$D,0),2)","v":"Military Transport / Special Mission"},"Kawasaki P-1"]
[{"$f":"INDEX('[1]Pt1-AvionicsComponentCosts'!$A:$C,MATCH(C57,'[1]Pt1-AvionicsComponentCosts'!$D:$D,0),1)","v":150},{"$f":"INDEX('[1]Pt1-AvionicsComponentCosts'!$A:$C,MATCH(C57,'[1]Pt1-AvionicsComponentCosts'!$D:$D,0),2)","v":"Military Transport / Special Mission"},"A400M Atlas"]
[{"$f":"INDEX('[1]Pt1-AvionicsComponentCosts'!$A:$C,MATCH(C58,'[1]Pt1-AvionicsComponentCosts'!$D:$D,0),1)","v":155},{"$f":"INDEX('[1]Pt1-AvionicsComponentCosts'!$A:$C,MATCH(C58,'[1]Pt1-AvionicsComponentCosts'!$D:$D,0),2)","v":"Military Transport / Special Mission"},"Alenia C-27J"]
[{"$f":"INDEX('[1]Pt1-AvionicsComponentCosts'!$A:$C,MATCH(C59,'[1]Pt1-AvionicsComponentCosts'!$D:$D,0),1)","v":162},{"$f":"INDEX('[1]Pt1-AvionicsComponentCosts'!$A:$C,MATCH(C59,'[1]Pt1-AvionicsComponentCosts'!$D:$D,0),2)","v":"Military Transport / Special Mission"},"C-130J"]
[{"$f":"INDEX('[1]Pt1-AvionicsComponentCosts'!$A:$C,MATCH(C60,'[1]Pt1-AvionicsComponentCosts'!$D:$D,0),1)","v":152},{"$f":"INDEX('[1]Pt1-AvionicsComponentCosts'!$A:$C,MATCH(C60,'[1]Pt1-AvionicsComponentCosts'!$D:$D,0),2)","v":"Military Transport / Special Mission"},"CASA C-212 Aviocar"]
[{"$f":"INDEX('[1]Pt1-AvionicsComponentCosts'!$A:$C,MATCH(C61,'[1]Pt1-AvionicsComponentCosts'!$D:$D,0),1)","v":153},{"$f":"INDEX('[1]Pt1-AvionicsComponentCosts'!$A:$C,MATCH(C61,'[1]Pt1-AvionicsComponentCosts'!$D:$D,0),2)","v":"Military Transport / Special Mission"},"CASA/IPTN CN-235"]
[{"$f":"INDEX('[1]Pt1-AvionicsComponentCosts'!$A:$C,MATCH(C62,'[1]Pt1-AvionicsComponentCosts'!$D:$D,0),1)","v":164},{"$f":"INDEX('[1]Pt1-AvionicsComponentCosts'!$A:$C,MATCH(C62,'[1]Pt1-AvionicsComponentCosts'!$D:$D,0),2)","v":"Military Transport / Special Mission"},"E-2"]
[{"$f":"INDEX('[1]Pt1-AvionicsComponentCosts'!$A:$C,MATCH(C63,'[1]Pt1-AvionicsComponentCosts'!$D:$D,0),1)","v":154},{"$f":"INDEX('[1]Pt1-AvionicsComponentCosts'!$A:$C,MATCH(C63,'[1]Pt1-AvionicsComponentCosts'!$D:$D,0),2)","v":"Military Transport / Special Mission"},"EADS CASA C-295"]
[{"$f":"INDEX('[1]Pt1-AvionicsComponentCosts'!$A:$C,MATCH(C64,'[1]Pt1-AvionicsComponentCosts'!$D:$D,0),1)","v":181},{"$f":"INDEX('[1]Pt1-AvionicsComponentCosts'!$A:$C,MATCH(C64,'[1]Pt1-AvionicsComponentCosts'!$D:$D,0),2)","v":"Military Transport / Special Mission"},"ShinMaywa US-2"]
[{"$f":"INDEX('[1]Pt1-AvionicsComponentCosts'!$A:$C,MATCH(C65,'[1]Pt1-AvionicsComponentCosts'!$D:$D,0),1)","v":620},{"$f":"INDEX('[1]Pt1-AvionicsComponentCosts'!$A:$C,MATCH(C65,'[1]Pt1-AvionicsComponentCosts'!$D:$D,0),2)","v":"Military Transport / Special Mission"},"Boeing KC-135 Stratotanker"]
[{"$f":"INDEX('[1]Pt1-AvionicsComponentCosts'!$A:$C,MATCH(C66,'[1]Pt1-AvionicsComponentCosts'!$D:$D,0),1)","v":619},{"$f":"INDEX('[1]Pt1-AvionicsComponentCosts'!$A:$C,MATCH(C66,'[1]Pt1-AvionicsComponentCosts'!$D:$D,0),2)","v":"Military Transport / Special Mission"},"McDonnell Douglas KC-10"]
[{"$f":"INDEX('[1]Pt1-AvionicsComponentCosts'!$A:$C,MATCH(C67,'[1]Pt1-AvionicsComponentCosts'!$D:$D,0),1)","v":618},{"$f":"INDEX('[1]Pt1-AvionicsComponentCosts'!$A:$C,MATCH(C67,'[1]Pt1-AvionicsComponentCosts'!$D:$D,0),2)","v":"Regional"},"Bombardier CRJ"]
[{"$f":"INDEX('[1]Pt1-AvionicsComponentCosts'!$A:$C,MATCH(C68,'[1]Pt1-AvionicsComponentCosts'!$D:$D,0),1)","v":27},{"$f":"INDEX('[1]Pt1-AvionicsComponentCosts'!$A:$C,MATCH(C68,'[1]Pt1-AvionicsComponentCosts'!$D:$D,0),2)","v":"Regional"},"Comac ARJ21"]
[{"$f":"INDEX('[1]Pt1-AvionicsComponentCosts'!$A:$C,MATCH(C69,'[1]Pt1-AvionicsComponentCosts'!$D:$D,0),1)","v":671},{"$f":"INDEX('[1]Pt1-AvionicsComponentCosts'!$A:$C,MATCH(C69,'[1]Pt1-AvionicsComponentCosts'!$D:$D,0),2)","v":"Freighter"},"Embraer E170/190"]
[{"$f":"INDEX('[1]Pt1-AvionicsComponentCosts'!$A:$C,MATCH(C70,'[1]Pt1-AvionicsComponentCosts'!$D:$D,0),1)","v":617},{"$f":"INDEX('[1]Pt1-AvionicsComponentCosts'!$A:$C,MATCH(C70,'[1]Pt1-AvionicsComponentCosts'!$D:$D,0),2)","v":"Regional"},"ERJ 135/140/145"]
[{"$f":"INDEX('[1]Pt1-AvionicsComponentCosts'!$A:$C,MATCH(C71,'[1]Pt1-AvionicsComponentCosts'!$D:$D,0),1)","v":29},{"$f":"INDEX('[1]Pt1-AvionicsComponentCosts'!$A:$C,MATCH(C71,'[1]Pt1-AvionicsComponentCosts'!$D:$D,0),2)","v":"Regional"},"Sukhoi Superjet"]
[{"$f":"INDEX('[1]Pt1-AvionicsComponentCosts'!$A:$C,MATCH(C72,'[1]Pt1-AvionicsComponentCosts'!$D:$D,0),1)","v":668},{"$f":"INDEX('[1]Pt1-AvionicsComponentCosts'!$A:$C,MATCH(C72,'[1]Pt1-AvionicsComponentCosts'!$D:$D,0),2)","v":"Freighter"},"ATR 42/72"]
[{"$f":"INDEX('[1]Pt1-AvionicsComponentCosts'!$A:$C,MATCH(C73,'[1]Pt1-AvionicsComponentCosts'!$D:$D,0),1)","v":647},{"$f":"INDEX('[1]Pt1-AvionicsComponentCosts'!$A:$C,MATCH(C73,'[1]Pt1-AvionicsComponentCosts'!$D:$D,0),2)","v":"Regional"},"ATR 42/72X"]
[{"$f":"INDEX('[1]Pt1-AvionicsComponentCosts'!$A:$C,MATCH(C74,'[1]Pt1-AvionicsComponentCosts'!$D:$D,0),1)","v":616},{"$f":"INDEX('[1]Pt1-AvionicsComponentCosts'!$A:$C,MATCH(C74,'[1]Pt1-AvionicsComponentCosts'!$D:$D,0),2)","v":"Regional"},"AVIC MA700"]
[{"$f":"INDEX('[1]Pt1-AvionicsComponentCosts'!$A:$C,MATCH(C75,'[1]Pt1-AvionicsComponentCosts'!$D:$D,0),1)","v":621},{"$f":"INDEX('[1]Pt1-AvionicsComponentCosts'!$A:$C,MATCH(C75,'[1]Pt1-AvionicsComponentCosts'!$D:$D,0),2)","v":"Regional"},"De Havilland Canada DHC-8"]
[{"$f":"INDEX('[1]Pt1-AvionicsComponentCosts'!$A:$C,MATCH(C76,'[1]Pt1-AvionicsComponentCosts'!$D:$D,0),1)","v":624},{"$f":"INDEX('[1]Pt1-AvionicsComponentCosts'!$A:$C,MATCH(C76,'[1]Pt1-AvionicsComponentCosts'!$D:$D,0),2)","v":"Regional"},"Dornier Do 328-100"]
[{"$f":"INDEX('[1]Pt1-AvionicsComponentCosts'!$A:$C,MATCH(C77,'[1]Pt1-AvionicsComponentCosts'!$D:$D,0),1)","v":625},{"$f":"INDEX('[1]Pt1-AvionicsComponentCosts'!$A:$C,MATCH(C77,'[1]Pt1-AvionicsComponentCosts'!$D:$D,0),2)","v":"Regional"},"Xian MA60"]
[{"$f":"INDEX('[1]Pt1-AvionicsComponentCosts'!$A:$C,MATCH(C78,'[1]Pt1-AvionicsComponentCosts'!$D:$D,0),1)","v":226},{"$f":"INDEX('[1]Pt1-AvionicsComponentCosts'!$A:$C,MATCH(C78,'[1]Pt1-AvionicsComponentCosts'!$D:$D,0),2)","v":"Turbine GA"},"Canadair CL-415"]
[{"$f":"INDEX('[1]Pt1-AvionicsComponentCosts'!$A:$C,MATCH(C79,'[1]Pt1-AvionicsComponentCosts'!$D:$D,0),1)","v":578},{"$f":"INDEX('[1]Pt1-AvionicsComponentCosts'!$A:$C,MATCH(C79,'[1]Pt1-AvionicsComponentCosts'!$D:$D,0),2)","v":"Fighters and Jet Trainers"},"Aero L-39NG"]
[{"$f":"INDEX('[1]Pt1-AvionicsComponentCosts'!$A:$C,MATCH(C80,'[1]Pt1-AvionicsComponentCosts'!$D:$D,0),1)","v":675},{"$f":"INDEX('[1]Pt1-AvionicsComponentCosts'!$A:$C,MATCH(C80,'[1]Pt1-AvionicsComponentCosts'!$D:$D,0),2)","v":"Fighters and Jet Trainers"},"AIDC T-5"]
[{"$f":"INDEX('[1]Pt1-AvionicsComponentCosts'!$A:$C,MATCH(C81,'[1]Pt1-AvionicsComponentCosts'!$D:$D,0),1)","v":171},{"$f":"INDEX('[1]Pt1-AvionicsComponentCosts'!$A:$C,MATCH(C81,'[1]Pt1-AvionicsComponentCosts'!$D:$D,0),2)","v":"Fighters and Jet Trainers"},"FMA IA 63 Pampa"]
[{"$f":"INDEX('[1]Pt1-AvionicsComponentCosts'!$A:$C,MATCH(C82,'[1]Pt1-AvionicsComponentCosts'!$D:$D,0),1)","v":167},{"$f":"INDEX('[1]Pt1-AvionicsComponentCosts'!$A:$C,MATCH(C82,'[1]Pt1-AvionicsComponentCosts'!$D:$D,0),2)","v":"Fighters and Jet Trainers"},"Hawk"]
[{"$f":"INDEX('[1]Pt1-AvionicsComponentCosts'!$A:$C,MATCH(C83,'[1]Pt1-AvionicsComponentCosts'!$D:$D,0),1)","v":174},{"$f":"INDEX('[1]Pt1-AvionicsComponentCosts'!$A:$C,MATCH(C83,'[1]Pt1-AvionicsComponentCosts'!$D:$D,0),2)","v":"Fighters and Jet Trainers"},"HJT-36 Sitara"]
[{"$f":"INDEX('[1]Pt1-AvionicsComponentCosts'!$A:$C,MATCH(C84,'[1]Pt1-AvionicsComponentCosts'!$D:$D,0),1)","v":173},{"$f":"INDEX('[1]Pt1-AvionicsComponentCosts'!$A:$C,MATCH(C84,'[1]Pt1-AvionicsComponentCosts'!$D:$D,0),2)","v":"Fighters and Jet Trainers"},"Hongdu K-8"]
[{"$f":"INDEX('[1]Pt1-AvionicsComponentCosts'!$A:$C,MATCH(C85,'[1]Pt1-AvionicsComponentCosts'!$D:$D,0),1)","v":165},{"$f":"INDEX('[1]Pt1-AvionicsComponentCosts'!$A:$C,MATCH(C85,'[1]Pt1-AvionicsComponentCosts'!$D:$D,0),2)","v":"Fighters and Jet Trainers"},"M-345"]
[{"$f":"INDEX('[1]Pt1-AvionicsComponentCosts'!$A:$C,MATCH(C86,'[1]Pt1-AvionicsComponentCosts'!$D:$D,0),1)","v":166},{"$f":"INDEX('[1]Pt1-AvionicsComponentCosts'!$A:$C,MATCH(C86,'[1]Pt1-AvionicsComponentCosts'!$D:$D,0),2)","v":"Fighters and Jet Trainers"},"M-346"]
[{"$f":"INDEX('[1]Pt1-AvionicsComponentCosts'!$A:$C,MATCH(C87,'[1]Pt1-AvionicsComponentCosts'!$D:$D,0),1)","v":168},{"$f":"INDEX('[1]Pt1-AvionicsComponentCosts'!$A:$C,MATCH(C87,'[1]Pt1-AvionicsComponentCosts'!$D:$D,0),2)","v":"Fighters and Jet Trainers"},"T-45"]
[{"$f":"INDEX('[1]Pt1-AvionicsComponentCosts'!$A:$C,MATCH(C88,'[1]Pt1-AvionicsComponentCosts'!$D:$D,0),1)","v":143},{"$f":"INDEX('[1]Pt1-AvionicsComponentCosts'!$A:$C,MATCH(C88,'[1]Pt1-AvionicsComponentCosts'!$D:$D,0),2)","v":"Fighters and Jet Trainers"},"Tejas"]
[{"$f":"INDEX('[1]Pt1-AvionicsComponentCosts'!$A:$C,MATCH(C89,'[1]Pt1-AvionicsComponentCosts'!$D:$D,0),1)","v":92},{"$f":"INDEX('[1]Pt1-AvionicsComponentCosts'!$A:$C,MATCH(C89,'[1]Pt1-AvionicsComponentCosts'!$D:$D,0),2)","v":"Helicopter"},"AH-1"]
[{"$f":"INDEX('[1]Pt1-AvionicsComponentCosts'!$A:$C,MATCH(C90,'[1]Pt1-AvionicsComponentCosts'!$D:$D,0),1)","v":98},{"$f":"INDEX('[1]Pt1-AvionicsComponentCosts'!$A:$C,MATCH(C90,'[1]Pt1-AvionicsComponentCosts'!$D:$D,0),2)","v":"Helicopter"},"AH-64"]
[{"$f":"INDEX('[1]Pt1-AvionicsComponentCosts'!$A:$C,MATCH(C91,'[1]Pt1-AvionicsComponentCosts'!$D:$D,0),1)","v":648},{"$f":"INDEX('[1]Pt1-AvionicsComponentCosts'!$A:$C,MATCH(C91,'[1]Pt1-AvionicsComponentCosts'!$D:$D,0),2)","v":"Helicopter"},"AW 249"]
[{"$f":"INDEX('[1]Pt1-AvionicsComponentCosts'!$A:$C,MATCH(C92,'[1]Pt1-AvionicsComponentCosts'!$D:$D,0),1)","v":132},{"$f":"INDEX('[1]Pt1-AvionicsComponentCosts'!$A:$C,MATCH(C92,'[1]Pt1-AvionicsComponentCosts'!$D:$D,0),2)","v":"Helicopter"},"Future Attack Reconnaissance Aircraft"]
[{"$f":"INDEX('[1]Pt1-AvionicsComponentCosts'!$A:$C,MATCH(C93,'[1]Pt1-AvionicsComponentCosts'!$D:$D,0),1)","v":85},{"$f":"INDEX('[1]Pt1-AvionicsComponentCosts'!$A:$C,MATCH(C93,'[1]Pt1-AvionicsComponentCosts'!$D:$D,0),2)","v":"Helicopter"},"TAI/Leonardo T129"]
[{"$f":"INDEX('[1]Pt1-AvionicsComponentCosts'!$A:$C,MATCH(C94,'[1]Pt1-AvionicsComponentCosts'!$D:$D,0),1)","v":104},{"$f":"INDEX('[1]Pt1-AvionicsComponentCosts'!$A:$C,MATCH(C94,'[1]Pt1-AvionicsComponentCosts'!$D:$D,0),2)","v":"Helicopter"},"Tiger"]
[{"$f":"INDEX('[1]Pt1-AvionicsComponentCosts'!$A:$C,MATCH(C95,'[1]Pt1-AvionicsComponentCosts'!$D:$D,0),1)","v":97},{"$f":"INDEX('[1]Pt1-AvionicsComponentCosts'!$A:$C,MATCH(C95,'[1]Pt1-AvionicsComponentCosts'!$D:$D,0),2)","v":"Helicopter"},"V-22"]
[{"$f":"INDEX('[1]Pt1-AvionicsComponentCosts'!$A:$C,MATCH(C96,'[1]Pt1-AvionicsComponentCosts'!$D:$D,0),1)","v":639},{"$f":"INDEX('[1]Pt1-AvionicsComponentCosts'!$A:$C,MATCH(C96,'[1]Pt1-AvionicsComponentCosts'!$D:$D,0),2)","v":"Helicopter"},"WAH-64"]
[{"$f":"INDEX('[1]Pt1-AvionicsComponentCosts'!$A:$C,MATCH(C97,'[1]Pt1-AvionicsComponentCosts'!$D:$D,0),1)","v":117},{"$f":"INDEX('[1]Pt1-AvionicsComponentCosts'!$A:$C,MATCH(C97,'[1]Pt1-AvionicsComponentCosts'!$D:$D,0),2)","v":"Helicopter"},"Airbus UH-72 Lakota"]
[{"$f":"INDEX('[1]Pt1-AvionicsComponentCosts'!$A:$C,MATCH(C98,'[1]Pt1-AvionicsComponentCosts'!$D:$D,0),1)","v":100},{"$f":"INDEX('[1]Pt1-AvionicsComponentCosts'!$A:$C,MATCH(C98,'[1]Pt1-AvionicsComponentCosts'!$D:$D,0),2)","v":"Helicopter"},"CH-47"]
[{"$f":"INDEX('[1]Pt1-AvionicsComponentCosts'!$A:$C,MATCH(C99,'[1]Pt1-AvionicsComponentCosts'!$D:$D,0),1)","v":116},{"$f":"INDEX('[1]Pt1-AvionicsComponentCosts'!$A:$C,MATCH(C99,'[1]Pt1-AvionicsComponentCosts'!$D:$D,0),2)","v":"Helicopter"},"HAL Dhruv"]
[{"$f":"INDEX('[1]Pt1-AvionicsComponentCosts'!$A:$C,MATCH(C100,'[1]Pt1-AvionicsComponentCosts'!$D:$D,0),1)","v":137},{"$f":"INDEX('[1]Pt1-AvionicsComponentCosts'!$A:$C,MATCH(C100,'[1]Pt1-AvionicsComponentCosts'!$D:$D,0),2)","v":"Helicopter"},"HAL Light Utility Helicopter"]
[{"$f":"INDEX('[1]Pt1-AvionicsComponentCosts'!$A:$C,MATCH(C101,'[1]Pt1-AvionicsComponentCosts'!$D:$D,0),1)","v":136},{"$f":"INDEX('[1]Pt1-AvionicsComponentCosts'!$A:$C,MATCH(C101,'[1]Pt1-AvionicsComponentCosts'!$D:$D,0),2)","v":"Helicopter"},"HAL Medium Lift"]
[{"$f":"INDEX('[1]Pt1-AvionicsComponentCosts'!$A:$C,MATCH(C102,'[1]Pt1-AvionicsComponentCosts'!$D:$D,0),1)","v":114},{"$f":"INDEX('[1]Pt1-AvionicsComponentCosts'!$A:$C,MATCH(C102,'[1]Pt1-AvionicsComponentCosts'!$D:$D,0),2)","v":"Helicopter"},"KAI KUH-1 Surion"]
[{"$f":"INDEX('[1]Pt1-AvionicsComponentCosts'!$A:$C,MATCH(C103,'[1]Pt1-AvionicsComponentCosts'!$D:$D,0),1)","v":118},{"$f":"INDEX('[1]Pt1-AvionicsComponentCosts'!$A:$C,MATCH(C103,'[1]Pt1-AvionicsComponentCosts'!$D:$D,0),2)","v":"Helicopter"},"Kawasaki OH-1"]
[{"$f":"INDEX('[1]Pt1-AvionicsComponentCosts'!$A:$C,MATCH(C104,'[1]Pt1-AvionicsComponentCosts'!$D:$D,0),1)","v":103},{"$f":"INDEX('[1]Pt1-AvionicsComponentCosts'!$A:$C,MATCH(C104,'[1]Pt1-AvionicsComponentCosts'!$D:$D,0),2)","v":"Helicopter"},"Leonardo AW101"]
[{"$f":"INDEX('[1]Pt1-AvionicsComponentCosts'!$A:$C,MATCH(C105,'[1]Pt1-AvionicsComponentCosts'!$D:$D,0),1)","v":134},{"$f":"INDEX('[1]Pt1-AvionicsComponentCosts'!$A:$C,MATCH(C105,'[1]Pt1-AvionicsComponentCosts'!$D:$D,0),2)","v":"Helicopter"},"Leonardo AW159 Lynx"]
[{"$f":"INDEX('[1]Pt1-AvionicsComponentCosts'!$A:$C,MATCH(C106,'[1]Pt1-AvionicsComponentCosts'!$D:$D,0),1)","v":582},{"$f":"INDEX('[1]Pt1-AvionicsComponentCosts'!$A:$C,MATCH(C106,'[1]Pt1-AvionicsComponentCosts'!$D:$D,0),2)","v":"Helicopter"},"MH139"]
[{"$f":"INDEX('[1]Pt1-AvionicsComponentCosts'!$A:$C,MATCH(C107,'[1]Pt1-AvionicsComponentCosts'!$D:$D,0),1)","v":122},{"$f":"INDEX('[1]Pt1-AvionicsComponentCosts'!$A:$C,MATCH(C107,'[1]Pt1-AvionicsComponentCosts'!$D:$D,0),2)","v":"Helicopter"},"NH90"]
[{"$f":"INDEX('[1]Pt1-AvionicsComponentCosts'!$A:$C,MATCH(C108,'[1]Pt1-AvionicsComponentCosts'!$D:$D,0),1)","v":182},{"$f":"INDEX('[1]Pt1-AvionicsComponentCosts'!$A:$C,MATCH(C108,'[1]Pt1-AvionicsComponentCosts'!$D:$D,0),2)","v":"Helicopter"},"OH-58"]
[{"$f":"INDEX('[1]Pt1-AvionicsComponentCosts'!$A:$C,MATCH(C109,'[1]Pt1-AvionicsComponentCosts'!$D:$D,0),1)","v":129},{"$f":"INDEX('[1]Pt1-AvionicsComponentCosts'!$A:$C,MATCH(C109,'[1]Pt1-AvionicsComponentCosts'!$D:$D,0),2)","v":"Helicopter"},"SH-60"]
[{"$f":"INDEX('[1]Pt1-AvionicsComponentCosts'!$A:$C,MATCH(C110,'[1]Pt1-AvionicsComponentCosts'!$D:$D,0),1)","v":127},{"$f":"INDEX('[1]Pt1-AvionicsComponentCosts'!$A:$C,MATCH(C110,'[1]Pt1-AvionicsComponentCosts'!$D:$D,0),2)","v":"Helicopter"},"Sikorsky CH-53K King Stallion"]
[{"$f":"INDEX('[1]Pt1-AvionicsComponentCosts'!$A:$C,MATCH(C111,'[1]Pt1-AvionicsComponentCosts'!$D:$D,0),1)","v":138},{"$f":"INDEX('[1]Pt1-AvionicsComponentCosts'!$A:$C,MATCH(C111,'[1]Pt1-AvionicsComponentCosts'!$D:$D,0),2)","v":"Helicopter"},"TAI T625"]
[{"$f":"INDEX('[1]Pt1-AvionicsComponentCosts'!$A:$C,MATCH(C112,'[1]Pt1-AvionicsComponentCosts'!$D:$D,0),1)","v":94},{"$f":"INDEX('[1]Pt1-AvionicsComponentCosts'!$A:$C,MATCH(C112,'[1]Pt1-AvionicsComponentCosts'!$D:$D,0),2)","v":"Helicopter"},"UH-1"]
[{"$f":"INDEX('[1]Pt1-AvionicsComponentCosts'!$A:$C,MATCH(C113,'[1]Pt1-AvionicsComponentCosts'!$D:$D,0),1)","v":131},{"$f":"INDEX('[1]Pt1-AvionicsComponentCosts'!$A:$C,MATCH(C113,'[1]Pt1-AvionicsComponentCosts'!$D:$D,0),2)","v":"Helicopter"},"UH-60"]
[{"$f":"INDEX('[1]Pt1-AvionicsComponentCosts'!$A:$C,MATCH(C114,'[1]Pt1-AvionicsComponentCosts'!$D:$D,0),1)","v":645},{"$f":"INDEX('[1]Pt1-AvionicsComponentCosts'!$A:$C,MATCH(C114,'[1]Pt1-AvionicsComponentCosts'!$D:$D,0),2)","v":"Helicopter"},"X6"]
[{"$f":"INDEX('[1]Pt1-AvionicsComponentCosts'!$A:$C,MATCH(C115,'[1]Pt1-AvionicsComponentCosts'!$D:$D,0),1)","v":175},{"$f":"INDEX('[1]Pt1-AvionicsComponentCosts'!$A:$C,MATCH(C115,'[1]Pt1-AvionicsComponentCosts'!$D:$D,0),2)","v":"Turboprop Trainers / Light Attack"},"KAI KT-1 Woongbi"]
[{"$f":"INDEX('[1]Pt1-AvionicsComponentCosts'!$A:$C,MATCH(C116,'[1]Pt1-AvionicsComponentCosts'!$D:$D,0),1)","v":306},{"$f":"INDEX('[1]Pt1-AvionicsComponentCosts'!$A:$C,MATCH(C116,'[1]Pt1-AvionicsComponentCosts'!$D:$D,0),2)","v":"Turboprop Trainers / Light Attack"},"TAI Hürkus"]
[{"$f":"INDEX('[1]Pt1-AvionicsComponentCosts'!$A:$C,MATCH(C117,'[1]Pt1-AvionicsComponentCosts'!$D:$D,0),1)","v":169},{"$f":"INDEX('[1]Pt1-AvionicsComponentCosts'!$A:$C,MATCH(C117,'[1]Pt1-AvionicsComponentCosts'!$D:$D,0),2)","v":"Turboprop Trainers / Light Attack"},"Beechcraft T-6 Texan II"]
[{"$f":"INDEX('[1]Pt1-AvionicsComponentCosts'!$A:$C,MATCH(C118,'[1]Pt1-AvionicsComponentCosts'!$D:$D,0),1)","v":172},{"$f":"INDEX('[1]Pt1-AvionicsComponentCosts'!$A:$C,MATCH(C118,'[1]Pt1-AvionicsComponentCosts'!$D:$D,0),2)","v":"Turboprop Trainers / Light Attack"},"Grob G 120TP"]
[{"$f":"INDEX('[1]Pt1-AvionicsComponentCosts'!$A:$C,MATCH(C119,'[1]Pt1-AvionicsComponentCosts'!$D:$D,0),1)","v":677},{"$f":"INDEX('[1]Pt1-AvionicsComponentCosts'!$A:$C,MATCH(C119,'[1]Pt1-AvionicsComponentCosts'!$D:$D,0),2)","v":"Turboprop Trainers / Light Attack"},"HHT-40"]
[{"$f":"INDEX('[1]Pt1-AvionicsComponentCosts'!$A:$C,MATCH(C120,'[1]Pt1-AvionicsComponentCosts'!$D:$D,0),1)","v":227},{"$f":"INDEX('[1]Pt1-AvionicsComponentCosts'!$A:$C,MATCH(C120,'[1]Pt1-AvionicsComponentCosts'!$D:$D,0),2)","v":"Turboprop Trainers / Light Attack"},"Other Turboprop trainers/light attack"]
[{"$f":"INDEX('[1]Pt1-AvionicsComponentCosts'!$A:$C,MATCH(C121,'[1]Pt1-AvionicsComponentCosts'!$D:$D,0),1)","v":177},{"$f":"INDEX('[1]Pt1-AvionicsComponentCosts'!$A:$C,MATCH(C121,'[1]Pt1-AvionicsComponentCosts'!$D:$D,0),2)","v":"Turboprop Trainers / Light Attack"},"PC-7"]
[{"$f":"INDEX('[1]Pt1-AvionicsComponentCosts'!$A:$C,MATCH(C122,'[1]Pt1-AvionicsComponentCosts'!$D:$D,0),1)","v":178},{"$f":"INDEX('[1]Pt1-AvionicsComponentCosts'!$A:$C,MATCH(C122,'[1]Pt1-AvionicsComponentCosts'!$D:$D,0),2)","v":"Turboprop Trainers / Light Attack"},"PC-9"]
[{"$f":"INDEX('[1]Pt1-AvionicsComponentCosts'!$A:$C,MATCH(C123,'[1]Pt1-AvionicsComponentCosts'!$D:$D,0),1)","v":170},{"$f":"INDEX('[1]Pt1-AvionicsComponentCosts'!$A:$C,MATCH(C123,'[1]Pt1-AvionicsComponentCosts'!$D:$D,0),2)","v":"Turboprop Trainers / Light Attack"},"Tucano"]
[{"$f":"INDEX('[1]Pt1-AvionicsComponentCosts'!$A:$C,MATCH(C124,'[1]Pt1-AvionicsComponentCosts'!$D:$D,0),1)","v":905},{"$f":"INDEX('[1]Pt1-AvionicsComponentCosts'!$A:$C,MATCH(C124,'[1]Pt1-AvionicsComponentCosts'!$D:$D,0),2)","v":"UAV"},"Other CUAV"]
[{"$f":"INDEX('[1]Pt1-AvionicsComponentCosts'!$A:$C,MATCH(C125,'[1]Pt1-AvionicsComponentCosts'!$D:$D,0),1)","v":901},{"$f":"INDEX('[1]Pt1-AvionicsComponentCosts'!$A:$C,MATCH(C125,'[1]Pt1-AvionicsComponentCosts'!$D:$D,0),2)","v":"UAV"},"Bayraktar TB-2"]
[{"$f":"INDEX('[1]Pt1-AvionicsComponentCosts'!$A:$C,MATCH(C126,'[1]Pt1-AvionicsComponentCosts'!$D:$D,0),1)","v":449},{"$f":"INDEX('[1]Pt1-AvionicsComponentCosts'!$A:$C,MATCH(C126,'[1]Pt1-AvionicsComponentCosts'!$D:$D,0),2)","v":"UAV"},"MQ-4C Triton"]
[{"$f":"INDEX('[1]Pt1-AvionicsComponentCosts'!$A:$C,MATCH(C127,'[1]Pt1-AvionicsComponentCosts'!$D:$D,0),1)","v":450},{"$f":"INDEX('[1]Pt1-AvionicsComponentCosts'!$A:$C,MATCH(C127,'[1]Pt1-AvionicsComponentCosts'!$D:$D,0),2)","v":"UAV"},"MQ-9 Reaper"]
[{"$f":"INDEX('[1]Pt1-AvionicsComponentCosts'!$A:$C,MATCH(C128,'[1]Pt1-AvionicsComponentCosts'!$D:$D,0),1)","v":902},{"$f":"INDEX('[1]Pt1-AvionicsComponentCosts'!$A:$C,MATCH(C128,'[1]Pt1-AvionicsComponentCosts'!$D:$D,0),2)","v":"UAV"},"Other MALE/HALE"]
[{"$f":"INDEX('[1]Pt1-AvionicsComponentCosts'!$A:$C,MATCH(C129,'[1]Pt1-AvionicsComponentCosts'!$D:$D,0),1)","v":452},{"$f":"INDEX('[1]Pt1-AvionicsComponentCosts'!$A:$C,MATCH(C129,'[1]Pt1-AvionicsComponentCosts'!$D:$D,0),2)","v":"UAV"},"RQ-4A Global Hawk"]
[{"$f":"INDEX('[1]Pt1-AvionicsComponentCosts'!$A:$C,MATCH(C130,'[1]Pt1-AvionicsComponentCosts'!$D:$D,0),1)","v":907},{"$f":"INDEX('[1]Pt1-AvionicsComponentCosts'!$A:$C,MATCH(C130,'[1]Pt1-AvionicsComponentCosts'!$D:$D,0),2)","v":"UAV"},"Other TUAV"]
[{"$f":"INDEX('[1]Pt1-AvionicsComponentCosts'!$A:$C,MATCH(C131,'[1]Pt1-AvionicsComponentCosts'!$D:$D,0),1)","v":906},{"$f":"INDEX('[1]Pt1-AvionicsComponentCosts'!$A:$C,MATCH(C131,'[1]Pt1-AvionicsComponentCosts'!$D:$D,0),2)","v":"UAV"},"RQ-7 Shadow"]
[{"$f":"INDEX('[1]Pt1-AvionicsComponentCosts'!$A:$C,MATCH(C132,'[1]Pt1-AvionicsComponentCosts'!$D:$D,0),1)","v":903},{"$f":"INDEX('[1]Pt1-AvionicsComponentCosts'!$A:$C,MATCH(C132,'[1]Pt1-AvionicsComponentCosts'!$D:$D,0),2)","v":"UAV"},"MQ-8"]
[{"$f":"INDEX('[1]Pt1-AvionicsComponentCosts'!$A:$C,MATCH(C133,'[1]Pt1-AvionicsComponentCosts'!$D:$D,0),1)","v":904},{"$f":"INDEX('[1]Pt1-AvionicsComponentCosts'!$A:$C,MATCH(C133,'[1]Pt1-AvionicsComponentCosts'!$D:$D,0),2)","v":"UAV"},"Other VTUAV"]
[{"$f":"INDEX('[1]Pt1-AvionicsComponentCosts'!$A:$C,MATCH(C134,'[1]Pt1-AvionicsComponentCosts'!$D:$D,0),1)","v":102},{"$f":"INDEX('[1]Pt1-AvionicsComponentCosts'!$A:$C,MATCH(C134,'[1]Pt1-AvionicsComponentCosts'!$D:$D,0),2)","v":"Helicopter"},"H175"]
[{"$f":"INDEX('[1]Pt1-AvionicsComponentCosts'!$A:$C,MATCH(C135,'[1]Pt1-AvionicsComponentCosts'!$D:$D,0),1)","v":105},{"$f":"INDEX('[1]Pt1-AvionicsComponentCosts'!$A:$C,MATCH(C135,'[1]Pt1-AvionicsComponentCosts'!$D:$D,0),2)","v":"Helicopter"},"H215 / H225"]
[{"$f":"INDEX('[1]Pt1-AvionicsComponentCosts'!$A:$C,MATCH(C136,'[1]Pt1-AvionicsComponentCosts'!$D:$D,0),1)","v":88},{"$f":"INDEX('[1]Pt1-AvionicsComponentCosts'!$A:$C,MATCH(C136,'[1]Pt1-AvionicsComponentCosts'!$D:$D,0),2)","v":"Helicopter"},"Leonardo AW169"]
[{"$f":"INDEX('[1]Pt1-AvionicsComponentCosts'!$A:$C,MATCH(C137,'[1]Pt1-AvionicsComponentCosts'!$D:$D,0),1)","v":87},{"$f":"INDEX('[1]Pt1-AvionicsComponentCosts'!$A:$C,MATCH(C137,'[1]Pt1-AvionicsComponentCosts'!$D:$D,0),2)","v":"Helicopter"},"Leonardo AW189"]
[{"$f":"INDEX('[1]Pt1-AvionicsComponentCosts'!$A:$C,MATCH(C138,'[1]Pt1-AvionicsComponentCosts'!$D:$D,0),1)","v":96},{"$f":"INDEX('[1]Pt1-AvionicsComponentCosts'!$A:$C,MATCH(C138,'[1]Pt1-AvionicsComponentCosts'!$D:$D,0),2)","v":"Helicopter"},"Leonardo AW609"]
[{"$f":"INDEX('[1]Pt1-AvionicsComponentCosts'!$A:$C,MATCH(C139,'[1]Pt1-AvionicsComponentCosts'!$D:$D,0),1)","v":125},{"$f":"INDEX('[1]Pt1-AvionicsComponentCosts'!$A:$C,MATCH(C139,'[1]Pt1-AvionicsComponentCosts'!$D:$D,0),2)","v":"Helicopter"},"S-76"]
[{"$f":"INDEX('[1]Pt1-AvionicsComponentCosts'!$A:$C,MATCH(C140,'[1]Pt1-AvionicsComponentCosts'!$D:$D,0),1)","v":126},{"$f":"INDEX('[1]Pt1-AvionicsComponentCosts'!$A:$C,MATCH(C140,'[1]Pt1-AvionicsComponentCosts'!$D:$D,0),2)","v":"Helicopter"},"S-92"]

{"sheet":"Sheet3","index":2,"n_rows":1,"n_cols":21,"rows_kept":1,"cut":false,"hidden":false,"merged":[]}
[null,null,null,null,882,null,773,null,775,null,833,null,822,null,785,null,805,null,784,null,774]

{"sheet":"Sheet4","index":3,"n_rows":374,"n_cols":20,"rows_kept":374,"cut":false,"hidden":false,"merged":[]}
["aircraft_id","aircraft_level_1","aircraft_level_2","aircraft_level_3","aircraft_level_4","engine_level_4","category",null,"IMA Items",null,710,null,774,775,784,785,805,822,833,882]
[674,"Business Jet","Large Jet","ACJ","Airbus ACJ TwoTwenty","Pratt & Whitney PW1500G","Narrow Body",null,{"$f":"SUM(K2:T2)>0","v":true},null,{"$f":"IFERROR(MATCH($A2&\"#\"&K$1,'[1]Pt1-DATA'!$C:$C,0),0)","v":313},null,{"$f":"IFERROR(MATCH($A2&\"#\"&M$1,'[1]Pt1-DATA'!$C:$C,0),0)","v":0},{"$f":"IFERROR(MATCH($A2&\"#\"&N$1,'[1]Pt1-DATA'!$C:$C,0),0)","v":7395},{"$f":"IFERROR(MATCH($A2&\"#\"&O$1,'[1]Pt1-DATA'!$C:$C,0),0)","v":0},{"$f":"IFERROR(MATCH($A2&\"#\"&P$1,'[1]Pt1-DATA'!$C:$C,0),0)","v":0},{"$f":"IFERROR(MATCH($A2&\"#\"&Q$1,'[1]Pt1-DATA'!$C:$C,0),0)","v":0},{"$f":"IFERROR(MATCH($A2&\"#\"&R$1,'[1]Pt1-DATA'!$C:$C,0),0)","v":0},{"$f":"IFERROR(MATCH($A2&\"#\"&S$1,'[1]Pt1-DATA'!$C:$C,0),0)","v":0},{"$f":"IFERROR(MATCH($A2&\"#\"&T$1,'[1]Pt1-DATA'!$C:$C,0),0)","v":0}]
[296,"Business Jet","Large Jet","ACJ","Airbus ACJ320 Family","CFM International CFM56 - 5B","Narrow Body",null,{"$f":"SUM(K3:T3)>0","v":true},null,{"$f":"IFERROR(MATCH($A3&\"#\"&K$1,'[1]Pt1-DATA'!$C:$C,0),0)","v":314},null,{"$f":"IFERROR(MATCH($A3&\"#\"&M$1,'[1]Pt1-DATA'!$C:$C,0),0)","v":0},{"$f":"IFERROR(MATCH($A3&\"#\"&N$1,'[1]Pt1-DATA'!$C:$C,0),0)","v":0},{"$f":"IFERROR(MATCH($A3&\"#\"&O$1,'[1]Pt1-DATA'!$C:$C,0),0)","v":0},{"$f":"IFERROR(MATCH($A3&\"#\"&P$1,'[1]Pt1-DATA'!$C:$C,0),0)","v":0},{"$f":"IFERROR(MATCH($A3&\"#\"&Q$1,'[1]Pt1-DATA'!$C:$C,0),0)","v":0},{"$f":"IFERROR(MATCH($A3&\"#\"&R$1,'[1]Pt1-DATA'!$C:$C,0),0)","v":0},{"$f":"IFERROR(MATCH($A3&\"#\"&S$1,'[1]Pt1-DATA'!$C:$C,0),0)","v":0},{"$f":"IFERROR(MATCH($A3&\"#\"&T$1,'[1]Pt1-DATA'!$C:$C,0),0)","v":0}]
[526,"Business Jet","Large Jet","ACJ","Airbus ACJ320 Family","IAE V2500-A5","Narrow Body",null,true,null,{"$f":"IFERROR(MATCH($A4&\"#\"&K$1,'[1]Pt1-DATA'!$C:$C,0),0)","v":315},null,{"$f":"IFERROR(MATCH($A4&\"#\"&M$1,'[1]Pt1-DATA'!$C:$C,0),0)","v":0},{"$f":"IFERROR(MATCH($A4&\"#\"&N$1,'[1]Pt1-DATA'!$C:$C,0),0)","v":0},{"$f":"IFERROR(MATCH($A4&\"#\"&O$1,'[1]Pt1-DATA'!$C:$C,0),0)","v":0},{"$f":"IFERROR(MATCH($A4&\"#\"&P$1,'[1]Pt1-DATA'!$C:$C,0),0)","v":0},{"$f":"IFERROR(MATCH($A4&\"#\"&Q$1,'[1]Pt1-DATA'!$C:$C,0),0)","v":0},{"$f":"IFERROR(MATCH($A4&\"#\"&R$1,'[1]Pt1-DATA'!$C:$C,0),0)","v":0},{"$f":"IFERROR(MATCH($A4&\"#\"&S$1,'[1]Pt1-DATA'!$C:$C,0),0)","v":0},{"$f":"IFERROR(MATCH($A4&\"#\"&T$1,'[1]Pt1-DATA'!$C:$C,0),0)","v":0}]
[528,"Business Jet","Large Jet","ACJ","Airbus ACJ320neo Family","CFM International LEAP-1A","Narrow Body",null,true,null,{"$f":"IFERROR(MATCH($A5&\"#\"&K$1,'[1]Pt1-DATA'!$C:$C,0),0)","v":316},null,{"$f":"IFERROR(MATCH($A5&\"#\"&M$1,'[1]Pt1-DATA'!$C:$C,0),0)","v":0},{"$f":"IFERROR(MATCH($A5&\"#\"&N$1,'[1]Pt1-DATA'!$C:$C,0),0)","v":0},{"$f":"IFERROR(MATCH($A5&\"#\"&O$1,'[1]Pt1-DATA'!$C:$C,0),0)","v":0},{"$f":"IFERROR(MATCH($A5&\"#\"&P$1,'[1]Pt1-DATA'!$C:$C,0),0)","v":0},{"$f":"IFERROR(MATCH($A5&\"#\"&Q$1,'[1]Pt1-DATA'!$C:$C,0),0)","v":0},{"$f":"IFERROR(MATCH($A5&\"#\"&R$1,'[1]Pt1-DATA'!$C:$C,0),0)","v":0},{"$f":"IFERROR(MATCH($A5&\"#\"&S$1,'[1]Pt1-DATA'!$C:$C,0),0)","v":0},{"$f":"IFERROR(MATCH($A5&\"#\"&T$1,'[1]Pt1-DATA'!$C:$C,0),0)","v":0}]
[527,"Business Jet","Large Jet","ACJ","Airbus ACJ320neo Family","Pratt & Whitney PW1100G","Narrow Body",null,true,null,{"$f":"IFERROR(MATCH($A6&\"#\"&K$1,'[1]Pt1-DATA'!$C:$C,0),0)","v":317},null,{"$f":"IFERROR(MATCH($A6&\"#\"&M$1,'[1]Pt1-DATA'!$C:$C,0),0)","v":0},{"$f":"IFERROR(MATCH($A6&\"#\"&N$1,'[1]Pt1-DATA'!$C:$C,0),0)","v":0},{"$f":"IFERROR(MATCH($A6&\"#\"&O$1,'[1]Pt1-DATA'!$C:$C,0),0)","v":0},{"$f":"IFERROR(MATCH($A6&\"#\"&P$1,'[1]Pt1-DATA'!$C:$C,0),0)","v":0},{"$f":"IFERROR(MATCH($A6&\"#\"&Q$1,'[1]Pt1-DATA'!$C:$C,0),0)","v":0},{"$f":"IFERROR(MATCH($A6&\"#\"&R$1,'[1]Pt1-DATA'!$C:$C,0),0)","v":0},{"$f":"IFERROR(MATCH($A6&\"#\"&S$1,'[1]Pt1-DATA'!$C:$C,0),0)","v":0},{"$f":"IFERROR(MATCH($A6&\"#\"&T$1,'[1]Pt1-DATA'!$C:$C,0),0)","v":0}]
[529,"Business Jet","Large Jet","BBJ","Boeing BBJ MAX","CFM International LEAP-1B","Narrow Body",null,true,null,{"$f":"IFERROR(MATCH($A7&\"#\"&K$1,'[1]Pt1-DATA'!$C:$C,0),0)","v":318},null,{"$f":"IFERROR(MATCH($A7&\"#\"&M$1,'[1]Pt1-DATA'!$C:$C,0),0)","v":0},{"$f":"IFERROR(MATCH($A7&\"#\"&N$1,'[1]Pt1-DATA'!$C:$C,0),0)","v":0},{"$f":"IFERROR(MATCH($A7&\"#\"&O$1,'[1]Pt1-DATA'!$C:$C,0),0)","v":0},{"$f":"IFERROR(MATCH($A7&\"#\"&P$1,'[1]Pt1-DATA'!$C:$C,0),0)","v":0},{"$f":"IFERROR(MATCH($A7&\"#\"&Q$1,'[1]Pt1-DATA'!$C:$C,0),0)","v":0},{"$f":"IFERROR(MATCH($A7&\"#\"&R$1,'[1]Pt1-DATA'!$C:$C,0),0)","v":0},{"$f":"IFERROR(MATCH($A7&\"#\"&S$1,'[1]Pt1-DATA'!$C:$C,0),0)","v":0},{"$f":"IFERROR(MATCH($A7&\"#\"&T$1,'[1]Pt1-DATA'!$C:$C,0),0)","v":0}]
[297,"Business Jet","Large Jet","BBJ","Boeing BBJ/BBJ2/BBJ3","CFM International CFM56 - 7B","Narrow Body",null,true,null,{"$f":"IFERROR(MATCH($A8&\"#\"&K$1,'[1]Pt1-DATA'!$C:$C,0),0)","v":319},null,{"$f":"IFERROR(MATCH($A8&\"#\"&M$1,'[1]Pt1-DATA'!$C:$C,0),0)","v":0},{"$f":"IFERROR(MATCH($A8&\"#\"&N$1,'[1]Pt1-DATA'!$C:$C,0),0)","v":0},{"$f":"IFERROR(MATCH($A8&\"#\"&O$1,'[1]Pt1-DATA'!$C:$C,0),0)","v":0},{"$f":"IFERROR(MATCH($A8&\"#\"&P$1,'[1]Pt1-DATA'!$C:$C,0),0)","v":0},{"$f":"IFERROR(MATCH($A8&\"#\"&Q$1,'[1]Pt1-DATA'!$C:$C,0),0)","v":0},{"$f":"IFERROR(MATCH($A8&\"#\"&R$1,'[1]Pt1-DATA'!$C:$C,0),0)","v":0},{"$f":"IFERROR(MATCH($A8&\"#\"&S$1,'[1]Pt1-DATA'!$C:$C,0),0)","v":0},{"$f":"IFERROR(MATCH($A8&\"#\"&T$1,'[1]Pt1-DATA'!$C:$C,0),0)","v":0}]
[594,"Business Jet","Large Jet","Boeing 747","Boeing 747-8 VIP","General Electric GEnx-2B","wide body (non IMA)",null,true,null,{"$f":"IFERROR(MATCH($A9&\"#\"&K$1,'[1]Pt1-DATA'!$C:$C,0),0)","v":394},null,{"$f":"IFERROR(MATCH($A9&\"#\"&M$1,'[1]Pt1-DATA'!$C:$C,0),0)","v":0},{"$f":"IFERROR(MATCH($A9&\"#\"&N$1,'[1]Pt1-DATA'!$C:$C,0),0)","v":7404},{"$f":"IFERROR(MATCH($A9&\"#\"&O$1,'[1]Pt1-DATA'!$C:$C,0),0)","v":7621},{"$f":"IFERROR(MATCH($A9&\"#\"&P$1,'[1]Pt1-DATA'!$C:$C,0),0)","v":0},{"$f":"IFERROR(MATCH($A9&\"#\"&Q$1,'[1]Pt1-DATA'!$C:$C,0),0)","v":0},{"$f":"IFERROR(MATCH($A9&\"#\"&R$1,'[1]Pt1-DATA'!$C:$C,0),0)","v":0},{"$f":"IFERROR(MATCH($A9&\"#\"&S$1,'[1]Pt1-DATA'!$C:$C,0),0)","v":0},{"$f":"IFERROR(MATCH($A9&\"#\"&T$1,'[1]Pt1-DATA'!$C:$C,0),0)","v":11614}]
[35,"Business Jet","Large Jet","Challenger 600 series","Bombardier Challenger 600 series","General Electric CF34-3B","bizjet",null,true,null,{"$f":"IFERROR(MATCH($A10&\"#\"&K$1,'[1]Pt1-DATA'!$C:$C,0),0)","v":290},null,{"$f":"IFERROR(MATCH($A10&\"#\"&M$1,'[1]Pt1-DATA'!$C:$C,0),0)","v":0},{"$f":"IFERROR(MATCH($A10&\"#\"&N$1,'[1]Pt1-DATA'!$C:$C,0),0)","v":0},{"$f":"IFERROR(MATCH($A10&\"#\"&O$1,'[1]Pt1-DATA'!$C:$C,0),0)","v":0},{"$f":"IFERROR(MATCH($A10&\"#\"&P$1,'[1]Pt1-DATA'!$C:$C,0),0)","v":0},{"$f":"IFERROR(MATCH($A10&\"#\"&Q$1,'[1]Pt1-DATA'!$C:$C,0),0)","v":0},{"$f":"IFERROR(MATCH($A10&\"#\"&R$1,'[1]Pt1-DATA'!$C:$C,0),0)","v":8726},{"$f":"IFERROR(MATCH($A10&\"#\"&S$1,'[1]Pt1-DATA'!$C:$C,0),0)","v":0},{"$f":"IFERROR(MATCH($A10&\"#\"&T$1,'[1]Pt1-DATA'!$C:$C,0),0)","v":0}]
[635,"Business Jet","Large Jet","Challenger 600 series","Bombardier Challenger 6XX series","General Electric CF34-3 (New)","bizjet",null,true,null,{"$f":"IFERROR(MATCH($A11&\"#\"&K$1,'[1]Pt1-DATA'!$C:$C,0),0)","v":291},null,{"$f":"IFERROR(MATCH($A11&\"#\"&M$1,'[1]Pt1-DATA'!$C:$C,0),0)","v":0},{"$f":"IFERROR(MATCH($A11&\"#\"&N$1,'[1]Pt1-DATA'!$C:$C,0),0)","v":0},{"$f":"IFERROR(MATCH($A11&\"#\"&O$1,'[1]Pt1-DATA'!$C:$C,0),0)","v":0},{"$f":"IFERROR(MATCH($A11&\"#\"&P$1,'[1]Pt1-DATA'!$C:$C,0),0)","v":0},{"$f":"IFERROR(MATCH($A11&\"#\"&Q$1,'[1]Pt1-DATA'!$C:$C,0),0)","v":0},{"$f":"IFERROR(MATCH($A11&\"#\"&R$1,'[1]Pt1-DATA'!$C:$C,0),0)","v":8727},{"$f":"IFERROR(MATCH($A11&\"#\"&S$1,'[1]Pt1-DATA'!$C:$C,0),0)","v":0},{"$f":"IFERROR(MATCH($A11&\"#\"&T$1,'[1]Pt1-DATA'!$C:$C,0),0)","v":0}]
[72,"Business Jet","Large Jet","Challenger 850","Bombardier Challenger 850","General Electric CF34-3B","bizjet",null,true,null,{"$f":"IFERROR(MATCH($A12&\"#\"&K$1,'[1]Pt1-DATA'!$C:$C,0),0)","v":292},null,{"$f":"IFERROR(MATCH($A12&\"#\"&M$1,'[1]Pt1-DATA'!$C:$C,0),0)","v":0},{"$f":"IFERROR(MATCH($A12&\"#\"&N$1,'[1]Pt1-DATA'!$C:$C,0),0)","v":0},{"$f":"IFERROR(MATCH($A12&\"#\"&O$1,'[1]Pt1-DATA'!$C:$C,0),0)","v":0},{"$f":"IFERROR(MATCH($A12&\"#\"&P$1,'[1]Pt1-DATA'!$C:$C,0),0)","v":0},{"$f":"IFERROR(MATCH($A12&\"#\"&Q$1,'[1]Pt1-DATA'!$C:$C,0),0)","v":0},{"$f":"IFERROR(MATCH($A12&\"#\"&R$1,'[1]Pt1-DATA'!$C:$C,0),0)","v":8728},{"$f":"IFERROR(MATCH($A12&\"#\"&S$1,'[1]Pt1-DATA'!$C:$C,0),0)","v":0},{"$f":"IFERROR(MATCH($A12&\"#\"&T$1,'[1]Pt1-DATA'!$C:$C,0),0)","v":0}]
[48,"Business Jet","Large Jet","Citation Hemisphere","Cessna Citation Hemisphere","Pratt & Whitney Canada PW800","bizjet",null,true,null,{"$f":"IFERROR(MATCH($A13&\"#\"&K$1,'[1]Pt1-DATA'!$C:$C,0),0)","v":293},null,{"$f":"IFERROR(MATCH($A13&\"#\"&M$1,'[1]Pt1-DATA'!$C:$C,0),0)","v":0},{"$f":"IFERROR(MATCH($A13&\"#\"&N$1,'[1]Pt1-DATA'!$C:$C,0),0)","v":0},{"$f":"IFERROR(MATCH($A13&\"#\"&O$1,'[1]Pt1-DATA'!$C:$C,0),0)","v":0},{"$f":"IFERROR(MATCH($A13&\"#\"&P$1,'[1]Pt1-DATA'!$C:$C,0),0)","v":0},{"$f":"IFERROR(MATCH($A13&\"#\"&Q$1,'[1]Pt1-DATA'!$C:$C,0),0)","v":0},{"$f":"IFERROR(MATCH($A13&\"#\"&R$1,'[1]Pt1-DATA'!$C:$C,0),0)","v":8729},{"$f":"IFERROR(MATCH($A13&\"#\"&S$1,'[1]Pt1-DATA'!$C:$C,0),0)","v":0},{"$f":"IFERROR(MATCH($A13&\"#\"&T$1,'[1]Pt1-DATA'!$C:$C,0),0)","v":0}]
[47,"Business Jet","Large Jet","Citation Longitude","Cessna Citation Longitude","Honeywell HTF7000 ","bizjet",null,true,null,{"$f":"IFERROR(MATCH($A14&\"#\"&K$1,'[1]Pt1-DATA'!$C:$C,0),0)","v":294},null,{"$f":"IFERROR(MATCH($A14&\"#\"&M$1,'[1]Pt1-DATA'!$C:$C,0),0)","v":0},{"$f":"IFERROR(MATCH($A14&\"#\"&N$1,'[1]Pt1-DATA'!$C:$C,0),0)","v":0},{"$f":"IFERROR(MATCH($A14&\"#\"&O$1,'[1]Pt1-DATA'!$C:$C,0),0)","v":0},{"$f":"IFERROR(MATCH($A14&\"#\"&P$1,'[1]Pt1-DATA'!$C:$C,0),0)","v":0},{"$f":"IFERROR(MATCH($A14&\"#\"&Q$1,'[1]Pt1-DATA'!$C:$C,0),0)","v":0},{"$f":"IFERROR(MATCH($A14&\"#\"&R$1,'[1]Pt1-DATA'!$C:$C,0),0)","v":8730},{"$f":"IFERROR(MATCH($A14&\"#\"&S$1,'[1]Pt1-DATA'!$C:$C,0),0)","v":0},{"$f":"IFERROR(MATCH($A14&\"#\"&T$1,'[1]Pt1-DATA'!$C:$C,0),0)","v":0}]
[587,"Business Jet","Large Jet","Falcon 10X","Dassault Falcon 10X","Rolls-Royce Pearl 10X","bizjet","IMA",true,null,{"$f":"IFERROR(MATCH($A15&\"#\"&K$1,'[1]Pt1-DATA'!$C:$C,0),0)","v":295},null,{"$f":"IFERROR(MATCH($A15&\"#\"&M$1,'[1]Pt1-DATA'!$C:$C,0),0)","v":0},{"$f":"IFERROR(MATCH($A15&\"#\"&N$1,'[1]Pt1-DATA'!$C:$C,0),0)","v":7381},{"$f":"IFERROR(MATCH($A15&\"#\"&O$1,'[1]Pt1-DATA'!$C:$C,0),0)","v":0},{"$f":"IFERROR(MATCH($A15&\"#\"&P$1,'[1]Pt1-DATA'!$C:$C,0),0)","v":0},{"$f":"IFERROR(MATCH($A15&\"#\"&Q$1,'[1]Pt1-DATA'!$C:$C,0),0)","v":0},{"$f":"IFERROR(MATCH($A15&\"#\"&R$1,'[1]Pt1-DATA'!$C:$C,0),0)","v":8731},{"$f":"IFERROR(MATCH($A15&\"#\"&S$1,'[1]Pt1-DATA'!$C:$C,0),0)","v":0},{"$f":"IFERROR(MATCH($A15&\"#\"&T$1,'[1]Pt1-DATA'!$C:$C,0),0)","v":0}]
[51,"Business Jet","Large Jet","Falcon 6X","Dassault Falcon 6X","Pratt & Whitney Canada PW800","bizjet","IMA",true,null,{"$f":"IFERROR(MATCH($A16&\"#\"&K$1,'[1]Pt1-DATA'!$C:$C,0),0)","v":296},null,{"$f":"IFERROR(MATCH($A16&\"#\"&M$1,'[1]Pt1-DATA'!$C:$C,0),0)","v":0},{"$f":"IFERROR(MATCH($A16&\"#\"&N$1,'[1]Pt1-DATA'!$C:$C,0),0)","v":7382},{"$f":"IFERROR(MATCH($A16&\"#\"&O$1,'[1]Pt1-DATA'!$C:$C,0),0)","v":0},{"$f":"IFERROR(MATCH($A16&\"#\"&P$1,'[1]Pt1-DATA'!$C:$C,0),0)","v":0},{"$f":"IFERROR(MATCH($A16&\"#\"&Q$1,'[1]Pt1-DATA'!$C:$C,0),0)","v":0},{"$f":"IFERROR(MATCH($A16&\"#\"&R$1,'[1]Pt1-DATA'!$C:$C,0),0)","v":8732},{"$f":"IFERROR(MATCH($A16&\"#\"&S$1,'[1]Pt1-DATA'!$C:$C,0),0)","v":0},{"$f":"IFERROR(MATCH($A16&\"#\"&T$1,'[1]Pt1-DATA'!$C:$C,0),0)","v":0}]
[54,"Business Jet","Large Jet","Falcon 7X/8X","Dassault Falcon 7X/8X","Pratt & Whitney Canada PW307A/D","bizjet","IMA",true,null,{"$f":"IFERROR(MATCH($A17&\"#\"&K$1,'[1]Pt1-DATA'!$C:$C,0),0)","v":297},null,{"$f":"IFERROR(MATCH($A17&\"#\"&M$1,'[1]Pt1-DATA'!$C:$C,0),0)","v":0},{"$f":"IFERROR(MATCH($A17&\"#\"&N$1,'[1]Pt1-DATA'!$C:$C,0),0)","v":7383},{"$f":"IFERROR(MATCH($A17&\"#\"&O$1,'[1]Pt1-DATA'!$C:$C,0),0)","v":0},{"$f":"IFERROR(MATCH($A17&\"#\"&P$1,'[1]Pt1-DATA'!$C:$C,0),0)","v":0},{"$f":"IFERROR(MATCH($A17&\"#\"&Q$1,'[1]Pt1-DATA'!$C:$C,0),0)","v":0},{"$f":"IFERROR(MATCH($A17&\"#\"&R$1,'[1]Pt1-DATA'!$C:$C,0),0)","v":8733},{"$f":"IFERROR(MATCH($A17&\"#\"&S$1,'[1]Pt1-DATA'!$C:$C,0),0)","v":0},{"$f":"IFERROR(MATCH($A17&\"#\"&T$1,'[1]Pt1-DATA'!$C:$C,0),0)","v":0}]
[50,"Business Jet","Large Jet","Falcon 900","Dassault Falcon 900","Honeywell TFE731","bizjet","IMA",true,null,{"$f":"IFERROR(MATCH($A18&\"#\"&K$1,'[1]Pt1-DATA'!$C:$C,0),0)","v":298},null,{"$f":"IFERROR(MATCH($A18&\"#\"&M$1,'[1]Pt1-DATA'!$C:$C,0),0)","v":0},{"$f":"IFERROR(MATCH($A18&\"#\"&N$1,'[1]Pt1-DATA'!$C:$C,0),0)","v":7384},{"$f":"IFERROR(MATCH($A18&\"#\"&O$1,'[1]Pt1-DATA'!$C:$C,0),0)","v":0},{"$f":"IFERROR(MATCH($A18&\"#\"&P$1,'[1]Pt1-DATA'!$C:$C,0),0)","v":0},{"$f":"IFERROR(MATCH($A18&\"#\"&Q$1,'[1]Pt1-DATA'!$C:$C,0),0)","v":0},{"$f":"IFERROR(MATCH($A18&\"#\"&R$1,'[1]Pt1-DATA'!$C:$C,0),0)","v":8734},{"$f":"IFERROR(MATCH($A18&\"#\"&S$1,'[1]Pt1-DATA'!$C:$C,0),0)","v":0},{"$f":"IFERROR(MATCH($A18&\"#\"&T$1,'[1]Pt1-DATA'!$C:$C,0),0)","v":0}]
[651,"Business Jet","Large Jet","G400","Gulfstream G400","Pratt & Whitney Canada PW800","bizjet",null,true,null,{"$f":"IFERROR(MATCH($A19&\"#\"&K$1,'[1]Pt1-DATA'!$C:$C,0),0)","v":342},null,{"$f":"IFERROR(MATCH($A19&\"#\"&M$1,'[1]Pt1-DATA'!$C:$C,0),0)","v":0},{"$f":"IFERROR(MATCH($A19&\"#\"&N$1,'[1]Pt1-DATA'!$C:$C,0),0)","v":0},{"$f":"IFERROR(MATCH($A19&\"#\"&O$1,'[1]Pt1-DATA'!$C:$C,0),0)","v":0},{"$f":"IFERROR(MATCH($A19&\"#\"&P$1,'[1]Pt1-DATA'!$C:$C,0),0)","v":0},{"$f":"IFERROR(MATCH($A19&\"#\"&Q$1,'[1]Pt1-DATA'!$C:$C,0),0)","v":0},{"$f":"IFERROR(MATCH($A19&\"#\"&R$1,'[1]Pt1-DATA'!$C:$C,0),0)","v":8748},{"$f":"IFERROR(MATCH($A19&\"#\"&S$1,'[1]Pt1-DATA'!$C:$C,0),0)","v":0},{"$f":"IFERROR(MATCH($A19&\"#\"&T$1,'[1]Pt1-DATA'!$C:$C,0),0)","v":0}]
[59,"Business Jet","Large Jet","G450","Gulfstream G450","Rolls-Royce Tay 611-8C","bizjet",null,true,null,{"$f":"IFERROR(MATCH($A20&\"#\"&K$1,'[1]Pt1-DATA'!$C:$C,0),0)","v":299},null,{"$f":"IFERROR(MATCH($A20&\"#\"&M$1,'[1]Pt1-DATA'!$C:$C,0),0)","v":0},{"$f":"IFERROR(MATCH($A20&\"#\"&N$1,'[1]Pt1-DATA'!$C:$C,0),0)","v":0},{"$f":"IFERROR(MATCH($A20&\"#\"&O$1,'[1]Pt1-DATA'!$C:$C,0),0)","v":0},{"$f":"IFERROR(MATCH($A20&\"#\"&P$1,'[1]Pt1-DATA'!$C:$C,0),0)","v":0},{"$f":"IFERROR(MATCH($A20&\"#\"&Q$1,'[1]Pt1-DATA'!$C:$C,0),0)","v":0},{"$f":"IFERROR(MATCH($A20&\"#\"&R$1,'[1]Pt1-DATA'!$C:$C,0),0)","v":8735},{"$f":"IFERROR(MATCH($A20&\"#\"&S$1,'[1]Pt1-DATA'!$C:$C,0),0)","v":0},{"$f":"IFERROR(MATCH($A20&\"#\"&T$1,'[1]Pt1-DATA'!$C:$C,0),0)","v":0}]
[61,"Business Jet","Large Jet","G500/G600","Gulfstream G500","Pratt & Whitney Canada PW800","bizjet",null,true,null,{"$f":"IFERROR(MATCH($A21&\"#\"&K$1,'[1]Pt1-DATA'!$C:$C,0),0)","v":300},null,{"$f":"IFERROR(MATCH($A21&\"#\"&M$1,'[1]Pt1-DATA'!$C:$C,0),0)","v":0},{"$f":"IFERROR(MATCH($A21&\"#\"&N$1,'[1]Pt1-DATA'!$C:$C,0),0)","v":0},{"$f":"IFERROR(MATCH($A21&\"#\"&O$1,'[1]Pt1-DATA'!$C:$C,0),0)","v":0},{"$f":"IFERROR(MATCH($A21&\"#\"&P$1,'[1]Pt1-DATA'!$C:$C,0),0)","v":0},{"$f":"IFERROR(MATCH($A21&\"#\"&Q$1,'[1]Pt1-DATA'!$C:$C,0),0)","v":0},{"$f":"IFERROR(MATCH($A21&\"#\"&R$1,'[1]Pt1-DATA'!$C:$C,0),0)","v":8736},{"$f":"IFERROR(MATCH($A21&\"#\"&S$1,'[1]Pt1-DATA'!$C:$C,0),0)","v":0},{"$f":"IFERROR(MATCH($A21&\"#\"&T$1,'[1]Pt1-DATA'!$C:$C,0),0)","v":0}]
[62,"Business Jet","Large Jet","G500/G600","Gulfstream G600 ","Pratt & Whitney Canada PW800","bizjet",null,true,null,{"$f":"IFERROR(MATCH($A22&\"#\"&K$1,'[1]Pt1-DATA'!$C:$C,0),0)","v":301},null,{"$f":"IFERROR(MATCH($A22&\"#\"&M$1,'[1]Pt1-DATA'!$C:$C,0),0)","v":0},{"$f":"IFERROR(MATCH($A22&\"#\"&N$1,'[1]Pt1-DATA'!$C:$C,0),0)","v":0},{"$f":"IFERROR(MATCH($A22&\"#\"&O$1,'[1]Pt1-DATA'!$C:$C,0),0)","v":0},{"$f":"IFERROR(MATCH($A22&\"#\"&P$1,'[1]Pt1-DATA'!$C:$C,0),0)","v":0},{"$f":"IFERROR(MATCH($A22&\"#\"&Q$1,'[1]Pt1-DATA'!$C:$C,0),0)","v":0},{"$f":"IFERROR(MATCH($A22&\"#\"&R$1,'[1]Pt1-DATA'!$C:$C,0),0)","v":8725},{"$f":"IFERROR(MATCH($A22&\"#\"&S$1,'[1]Pt1-DATA'!$C:$C,0),0)","v":0},{"$f":"IFERROR(MATCH($A22&\"#\"&T$1,'[1]Pt1-DATA'!$C:$C,0),0)","v":0}]
[60,"Business Jet","Large Jet","G550","Gulfstream G550","Rolls-Royce BR710","bizjet",null,true,null,{"$f":"IFERROR(MATCH($A23&\"#\"&K$1,'[1]Pt1-DATA'!$C:$C,0),0)","v":302},null,{"$f":"IFERROR(MATCH($A23&\"#\"&M$1,'[1]Pt1-DATA'!$C:$C,0),0)","v":0},{"$f":"IFERROR(MATCH($A23&\"#\"&N$1,'[1]Pt1-DATA'!$C:$C,0),0)","v":0},{"$f":"IFERROR(MATCH($A23&\"#\"&O$1,'[1]Pt1-DATA'!$C:$C,0),0)","v":0},{"$f":"IFERROR(MATCH($A23&\"#\"&P$1,'[1]Pt1-DATA'!$C:$C,0),0)","v":0},{"$f":"IFERROR(MATCH($A23&\"#\"&Q$1,'[1]Pt1-DATA'!$C:$C,0),0)","v":0},{"$f":"IFERROR(MATCH($A23&\"#\"&R$1,'[1]Pt1-DATA'!$C:$C,0),0)","v":8737},{"$f":"IFERROR(MATCH($A23&\"#\"&S$1,'[1]Pt1-DATA'!$C:$C,0),0)","v":0},{"$f":"IFERROR(MATCH($A23&\"#\"&T$1,'[1]Pt1-DATA'!$C:$C,0),0)","v":0}]
[63,"Business Jet","Large Jet","G650","Gulfstream G650","Rolls-Royce BR725","bizjet",null,true,null,{"$f":"IFERROR(MATCH($A24&\"#\"&K$1,'[1]Pt1-DATA'!$C:$C,0),0)","v":303},null,{"$f":"IFERROR(MATCH($A24&\"#\"&M$1,'[1]Pt1-DATA'!$C:$C,0),0)","v":0},{"$f":"IFERROR(MATCH($A24&\"#\"&N$1,'[1]Pt1-DATA'!$C:$C,0),0)","v":0},{"$f":"IFERROR(MATCH($A24&\"#\"&O$1,'[1]Pt1-DATA'!$C:$C,0),0)","v":0},{"$f":"IFERROR(MATCH($A24&\"#\"&P$1,'[1]Pt1-DATA'!$C:$C,0),0)","v":0},{"$f":"IFERROR(MATCH($A24&\"#\"&Q$1,'[1]Pt1-DATA'!$C:$C,0),0)","v":0},{"$f":"IFERROR(MATCH($A24&\"#\"&R$1,'[1]Pt1-DATA'!$C:$C,0),0)","v":8738},{"$f":"IFERROR(MATCH($A24&\"#\"&S$1,'[1]Pt1-DATA'!$C:$C,0),0)","v":0},{"$f":"IFERROR(MATCH($A24&\"#\"&T$1,'[1]Pt1-DATA'!$C:$C,0),0)","v":0}]
[598,"Business Jet","Large Jet","G700","Gulfstream G700","Rolls-Royce Pearl 700","bizjet",null,true,null,{"$f":"IFERROR(MATCH($A25&\"#\"&K$1,'[1]Pt1-DATA'!$C:$C,0),0)","v":304},null,{"$f":"IFERROR(MATCH($A25&\"#\"&M$1,'[1]Pt1-DATA'!$C:$C,0),0)","v":0},{"$f":"IFERROR(MATCH($A25&\"#\"&N$1,'[1]Pt1-DATA'!$C:$C,0),0)","v":0},{"$f":"IFERROR(MATCH($A25&\"#\"&O$1,'[1]Pt1-DATA'!$C:$C,0),0)","v":0},{"$f":"IFERROR(MATCH($A25&\"#\"&P$1,'[1]Pt1-DATA'!$C:$C,0),0)","v":0},{"$f":"IFERROR(MATCH($A25&\"#\"&Q$1,'[1]Pt1-DATA'!$C:$C,0),0)","v":0},{"$f":"IFERROR(MATCH($A25&\"#\"&R$1,'[1]Pt1-DATA'!$C:$C,0),0)","v":8739},{"$f":"IFERROR(MATCH($A25&\"#\"&S$1,'[1]Pt1-DATA'!$C:$C,0),0)","v":0},{"$f":"IFERROR(MATCH($A25&\"#\"&T$1,'[1]Pt1-DATA'!$C:$C,0),0)","v":0}]
[670,"Business Jet","Large Jet","G800","Gulfstream G800","Rolls-Royce Pearl 700","bizjet",null,true,null,{"$f":"IFERROR(MATCH($A26&\"#\"&K$1,'[1]Pt1-DATA'!$C:$C,0),0)","v":343},null,{"$f":"IFERROR(MATCH($A26&\"#\"&M$1,'[1]Pt1-DATA'!$C:$C,0),0)","v":0},{"$f":"IFERROR(MATCH($A26&\"#\"&N$1,'[1]Pt1-DATA'!$C:$C,0),0)","v":0},{"$f":"IFERROR(MATCH($A26&\"#\"&O$1,'[1]Pt1-DATA'!$C:$C,0),0)","v":0},{"$f":"IFERROR(MATCH($A26&\"#\"&P$1,'[1]Pt1-DATA'!$C:$C,0),0)","v":0},{"$f":"IFERROR(MATCH($A26&\"#\"&Q$1,'[1]Pt1-DATA'!$C:$C,0),0)","v":0},{"$f":"IFERROR(MATCH($A26&\"#\"&R$1,'[1]Pt1-DATA'!$C:$C,0),0)","v":8749},{"$f":"IFERROR(MATCH($A26&\"#\"&S$1,'[1]Pt1-DATA'!$C:$C,0),0)","v":0},{"$f":"IFERROR(MATCH($A26&\"#\"&T$1,'[1]Pt1-DATA'!$C:$C,0),0)","v":0}]
[38,"Business Jet","Large Jet","Global 7000","Bombardier Global 7500/8000","General Electric Passport","bizjet","IMA",true,null,{"$f":"IFERROR(MATCH($A27&\"#\"&K$1,'[1]Pt1-DATA'!$C:$C,0),0)","v":305},null,{"$f":"IFERROR(MATCH($A27&\"#\"&M$1,'[1]Pt1-DATA'!$C:$C,0),0)","v":0},{"$f":"IFERROR(MATCH($A27&\"#\"&N$1,'[1]Pt1-DATA'!$C:$C,0),0)","v":7385},{"$f":"IFERROR(MATCH($A27&\"#\"&O$1,'[1]Pt1-DATA'!$C:$C,0),0)","v":0},{"$f":"IFERROR(MATCH($A27&\"#\"&P$1,'[1]Pt1-DATA'!$C:$C,0),0)","v":0},{"$f":"IFERROR(MATCH($A27&\"#\"&Q$1,'[1]Pt1-DATA'!$C:$C,0),0)","v":0},{"$f":"IFERROR(MATCH($A27&\"#\"&R$1,'[1]Pt1-DATA'!$C:$C,0),0)","v":8740},{"$f":"IFERROR(MATCH($A27&\"#\"&S$1,'[1]Pt1-DATA'!$C:$C,0),0)","v":0},{"$f":"IFERROR(MATCH($A27&\"#\"&T$1,'[1]Pt1-DATA'!$C:$C,0),0)","v":0}]
[36,"Business Jet","Large Jet","Global Express - 5000/6000","Bombardier Global 5000","Rolls-Royce BR710","bizjet","IMA",true,null,{"$f":"IFERROR(MATCH($A28&\"#\"&K$1,'[1]Pt1-DATA'!$C:$C,0),0)","v":306},null,{"$f":"IFERROR(MATCH($A28&\"#\"&M$1,'[1]Pt1-DATA'!$C:$C,0),0)","v":0},{"$f":"IFERROR(MATCH($A28&\"#\"&N$1,'[1]Pt1-DATA'!$C:$C,0),0)","v":7386},{"$f":"IFERROR(MATCH($A28&\"#\"&O$1,'[1]Pt1-DATA'!$C:$C,0),0)","v":0},{"$f":"IFERROR(MATCH($A28&\"#\"&P$1,'[1]Pt1-DATA'!$C:$C,0),0)","v":0},{"$f":"IFERROR(MATCH($A28&\"#\"&Q$1,'[1]Pt1-DATA'!$C:$C,0),0)","v":0},{"$f":"IFERROR(MATCH($A28&\"#\"&R$1,'[1]Pt1-DATA'!$C:$C,0),0)","v":8741},{"$f":"IFERROR(MATCH($A28&\"#\"&S$1,'[1]Pt1-DATA'!$C:$C,0),0)","v":0},{"$f":"IFERROR(MATCH($A28&\"#\"&T$1,'[1]Pt1-DATA'!$C:$C,0),0)","v":0}]
[576,"Business Jet","Large Jet","Global Express - 5000/6000","Bombardier Global 5500","Rolls-Royce Pearl 15","bizjet","IMA",true,null,{"$f":"IFERROR(MATCH($A29&\"#\"&K$1,'[1]Pt1-DATA'!$C:$C,0),0)","v":307},null,{"$f":"IFERROR(MATCH($A29&\"#\"&M$1,'[1]Pt1-DATA'!$C:$C,0),0)","v":0},{"$f":"IFERROR(MATCH($A29&\"#\"&N$1,'[1]Pt1-DATA'!$C:$C,0),0)","v":7387},{"$f":"IFERROR(MATCH($A29&\"#\"&O$1,'[1]Pt1-DATA'!$C:$C,0),0)","v":0},{"$f":"IFERROR(MATCH($A29&\"#\"&P$1,'[1]Pt1-DATA'!$C:$C,0),0)","v":0},{"$f":"IFERROR(MATCH($A29&\"#\"&Q$1,'[1]Pt1-DATA'!$C:$C,0),0)","v":0},{"$f":"IFERROR(MATCH($A29&\"#\"&R$1,'[1]Pt1-DATA'!$C:$C,0),0)","v":8742},{"$f":"IFERROR(MATCH($A29&\"#\"&S$1,'[1]Pt1-DATA'!$C:$C,0),0)","v":0},{"$f":"IFERROR(MATCH($A29&\"#\"&T$1,'[1]Pt1-DATA'!$C:$C,0),0)","v":0}]
[37,"Business Jet","Large Jet","Global Express - 5000/6000","Bombardier Global 6000","Rolls-Royce BR710","bizjet","IMA",true,null,{"$f":"IFERROR(MATCH($A30&\"#\"&K$1,'[1]Pt1-DATA'!$C:$C,0),0)","v":308},null,{"$f":"IFERROR(MATCH($A30&\"#\"&M$1,'[1]Pt1-DATA'!$C:$C,0),0)","v":0},{"$f":"IFERROR(MATCH($A30&\"#\"&N$1,'[1]Pt1-DATA'!$C:$C,0),0)","v":7388},{"$f":"IFERROR(MATCH($A30&\"#\"&O$1,'[1]Pt1-DATA'!$C:$C,0),0)","v":0},{"$f":"IFERROR(MATCH($A30&\"#\"&P$1,'[1]Pt1-DATA'!$C:$C,0),0)","v":0},{"$f":"IFERROR(MATCH($A30&\"#\"&Q$1,'[1]Pt1-DATA'!$C:$C,0),0)","v":0},{"$f":"IFERROR(MATCH($A30&\"#\"&R$1,'[1]Pt1-DATA'!$C:$C,0),0)","v":8743},{"$f":"IFERROR(MATCH($A30&\"#\"&S$1,'[1]Pt1-DATA'!$C:$C,0),0)","v":0},{"$f":"IFERROR(MATCH($A30&\"#\"&T$1,'[1]Pt1-DATA'!$C:$C,0),0)","v":0}]
[577,"Business Jet","Large Jet","Global Express - 5000/6000","Bombardier Global 6500","Rolls-Royce Pearl 15","bizjet","IMA",true,null,{"$f":"IFERROR(MATCH($A31&\"#\"&K$1,'[1]Pt1-DATA'!$C:$C,0),0)","v":309},null,{"$f":"IFERROR(MATCH($A31&\"#\"&M$1,'[1]Pt1-DATA'!$C:$C,0),0)","v":0},{"$f":"IFERROR(MATCH($A31&\"#\"&N$1,'[1]Pt1-DATA'!$C:$C,0),0)","v":7389},{"$f":"IFERROR(MATCH($A31&\"#\"&O$1,'[1]Pt1-DATA'!$C:$C,0),0)","v":0},{"$f":"IFERROR(MATCH($A31&\"#\"&P$1,'[1]Pt1-DATA'!$C:$C,0),0)","v":0},{"$f":"IFERROR(MATCH($A31&\"#\"&Q$1,'[1]Pt1-DATA'!$C:$C,0),0)","v":0},{"$f":"IFERROR(MATCH($A31&\"#\"&R$1,'[1]Pt1-DATA'!$C:$C,0),0)","v":8744},{"$f":"IFERROR(MATCH($A31&\"#\"&S$1,'[1]Pt1-DATA'!$C:$C,0),0)","v":0},{"$f":"IFERROR(MATCH($A31&\"#\"&T$1,'[1]Pt1-DATA'!$C:$C,0),0)","v":0}]
[74,"Business Jet","Large Jet","Legacy 600/650","Embraer Legacy 600/650","Rolls-Royce AE 3007","bizjet",null,true,null,{"$f":"IFERROR(MATCH($A32&\"#\"&K$1,'[1]Pt1-DATA'!$C:$C,0),0)","v":310},null,{"$f":"IFERROR(MATCH($A32&\"#\"&M$1,'[1]Pt1-DATA'!$C:$C,0),0)","v":0},{"$f":"IFERROR(MATCH($A32&\"#\"&N$1,'[1]Pt1-DATA'!$C:$C,0),0)","v":0},{"$f":"IFERROR(MATCH($A32&\"#\"&O$1,'[1]Pt1-DATA'!$C:$C,0),0)","v":0},{"$f":"IFERROR(MATCH($A32&\"#\"&P$1,'[1]Pt1-DATA'!$C:$C,0),0)","v":0},{"$f":"IFERROR(MATCH($A32&\"#\"&Q$1,'[1]Pt1-DATA'!$C:$C,0),0)","v":0},{"$f":"IFERROR(MATCH($A32&\"#\"&R$1,'[1]Pt1-DATA'!$C:$C,0),0)","v":8745},{"$f":"IFERROR(MATCH($A32&\"#\"&S$1,'[1]Pt1-DATA'!$C:$C,0),0)","v":0},{"$f":"IFERROR(MATCH($A32&\"#\"&T$1,'[1]Pt1-DATA'!$C:$C,0),0)","v":0}]
[652,"Business Jet","Large Jet","Legacy 700","Embraer legacy 700","Rolls-Royce Pearl 15","bizjet",null,true,null,{"$f":"IFERROR(MATCH($A33&\"#\"&K$1,'[1]Pt1-DATA'!$C:$C,0),0)","v":311},null,{"$f":"IFERROR(MATCH($A33&\"#\"&M$1,'[1]Pt1-DATA'!$C:$C,0),0)","v":0},{"$f":"IFERROR(MATCH($A33&\"#\"&N$1,'[1]Pt1-DATA'!$C:$C,0),0)","v":0},{"$f":"IFERROR(MATCH($A33&\"#\"&O$1,'[1]Pt1-DATA'!$C:$C,0),0)","v":0},{"$f":"IFERROR(MATCH($A33&\"#\"&P$1,'[1]Pt1-DATA'!$C:$C,0),0)","v":0},{"$f":"IFERROR(MATCH($A33&\"#\"&Q$1,'[1]Pt1-DATA'!$C:$C,0),0)","v":0},{"$f":"IFERROR(MATCH($A33&\"#\"&R$1,'[1]Pt1-DATA'!$C:$C,0),0)","v":8746},{"$f":"IFERROR(MATCH($A33&\"#\"&S$1,'[1]Pt1-DATA'!$C:$C,0),0)","v":0},{"$f":"IFERROR(MATCH($A33&\"#\"&T$1,'[1]Pt1-DATA'!$C:$C,0),0)","v":0}]
[73,"Business Jet","Large Jet","Lineage 1000","Embraer Lineage 1000","General Electric CF34-10E","bizjet",null,true,null,{"$f":"IFERROR(MATCH($A34&\"#\"&K$1,'[1]Pt1-DATA'!$C:$C,0),0)","v":312},null,{"$f":"IFERROR(MATCH($A34&\"#\"&M$1,'[1]Pt1-DATA'!$C:$C,0),0)","v":0},{"$f":"IFERROR(MATCH($A34&\"#\"&N$1,'[1]Pt1-DATA'!$C:$C,0),0)","v":0},{"$f":"IFERROR(MATCH($A34&\"#\"&O$1,'[1]Pt1-DATA'!$C:$C,0),0)","v":0},{"$f":"IFERROR(MATCH($A34&\"#\"&P$1,'[1]Pt1-DATA'!$C:$C,0),0)","v":0},{"$f":"IFERROR(MATCH($A34&\"#\"&Q$1,'[1]Pt1-DATA'!$C:$C,0),0)","v":0},{"$f":"IFERROR(MATCH($A34&\"#\"&R$1,'[1]Pt1-DATA'!$C:$C,0),0)","v":8747},{"$f":"IFERROR(MATCH($A34&\"#\"&S$1,'[1]Pt1-DATA'!$C:$C,0),0)","v":0},{"$f":"IFERROR(MATCH($A34&\"#\"&T$1,'[1]Pt1-DATA'!$C:$C,0),0)","v":0}]
[678,"Business Jet","Large Jet","Wide body VIP","Airbus ACJ330-200","Rolls-Royce Trent 700","wide body (non IMA)",null,true,null,{"$f":"IFERROR(MATCH($A35&\"#\"&K$1,'[1]Pt1-DATA'!$C:$C,0),0)","v":395},null,{"$f":"IFERROR(MATCH($A35&\"#\"&M$1,'[1]Pt1-DATA'!$C:$C,0),0)","v":0},{"$f":"IFERROR(MATCH($A35&\"#\"&N$1,'[1]Pt1-DATA'!$C:$C,0),0)","v":0},{"$f":"IFERROR(MATCH($A35&\"#\"&O$1,'[1]Pt1-DATA'!$C:$C,0),0)","v":0},{"$f":"IFERROR(MATCH($A35&\"#\"&P$1,'[1]Pt1-DATA'!$C:$C,0),0)","v":0},{"$f":"IFERROR(MATCH($A35&\"#\"&Q$1,'[1]Pt1-DATA'!$C:$C,0),0)","v":0},{"$f":"IFERROR(MATCH($A35&\"#\"&R$1,'[1]Pt1-DATA'!$C:$C,0),0)","v":0},{"$f":"IFERROR(MATCH($A35&\"#\"&S$1,'[1]Pt1-DATA'!$C:$C,0),0)","v":0},{"$f":"IFERROR(MATCH($A35&\"#\"&T$1,'[1]Pt1-DATA'!$C:$C,0),0)","v":11662}]
[298,"Business Jet","Large Jet","Wide body VIP","Boeing BBJ 777","General Electric GE90-115B","wide body (IMA)",null,true,null,{"$f":"IFERROR(MATCH($A36&\"#\"&K$1,'[1]Pt1-DATA'!$C:$C,0),0)","v":396},null,{"$f":"IFERROR(MATCH($A36&\"#\"&M$1,'[1]Pt1-DATA'!$C:$C,0),0)","v":0},{"$f":"IFERROR(MATCH($A36&\"#\"&N$1,'[1]Pt1-DATA'!$C:$C,0),0)","v":7405},{"$f":"IFERROR(MATCH($A36&\"#\"&O$1,'[1]Pt1-DATA'!$C:$C,0),0)","v":7622},{"$f":"IFERROR(MATCH($A36&\"#\"&P$1,'[1]Pt1-DATA'!$C:$C,0),0)","v":0},{"$f":"IFERROR(MATCH($A36&\"#\"&Q$1,'[1]Pt1-DATA'!$C:$C,0),0)","v":0},{"$f":"IFERROR(MATCH($A36&\"#\"&R$1,'[1]Pt1-DATA'!$C:$C,0),0)","v":0},{"$f":"IFERROR(MATCH($A36&\"#\"&S$1,'[1]Pt1-DATA'!$C:$C,0),0)","v":0},{"$f":"IFERROR(MATCH($A36&\"#\"&T$1,'[1]Pt1-DATA'!$C:$C,0),0)","v":11615}]
[553,"Business Jet","Large Jet","Wide body VIP","Boeing BBJ 777X","General Electric GE9X","wide body (IMA)",null,true,null,{"$f":"IFERROR(MATCH($A37&\"#\"&K$1,'[1]Pt1-DATA'!$C:$C,0),0)","v":397},null,{"$f":"IFERROR(MATCH($A37&\"#\"&M$1,'[1]Pt1-DATA'!$C:$C,0),0)","v":0},{"$f":"IFERROR(MATCH($A37&\"#\"&N$1,'[1]Pt1-DATA'!$C:$C,0),0)","v":0},{"$f":"IFERROR(MATCH($A37&\"#\"&O$1,'[1]Pt1-DATA'!$C:$C,0),0)","v":0},{"$f":"IFERROR(MATCH($A37&\"#\"&P$1,'[1]Pt1-DATA'!$C:$C,0),0)","v":0},{"$f":"IFERROR(MATCH($A37&\"#\"&Q$1,'[1]Pt1-DATA'!$C:$C,0),0)","v":0},{"$f":"IFERROR(MATCH($A37&\"#\"&R$1,'[1]Pt1-DATA'!$C:$C,0),0)","v":0},{"$f":"IFERROR(MATCH($A37&\"#\"&S$1,'[1]Pt1-DATA'!$C:$C,0),0)","v":0},{"$f":"IFERROR(MATCH($A37&\"#\"&T$1,'[1]Pt1-DATA'!$C:$C,0),0)","v":11663}]
[554,"Business Jet","Large Jet","Wide body VIP","Boeing BBJ 787","General Electric GEnx-1B","wide body (IMA)",null,true,null,{"$f":"IFERROR(MATCH($A38&\"#\"&K$1,'[1]Pt1-DATA'!$C:$C,0),0)","v":398},null,{"$f":"IFERROR(MATCH($A38&\"#\"&M$1,'[1]Pt1-DATA'!$C:$C,0),0)","v":0},{"$f":"IFERROR(MATCH($A38&\"#\"&N$1,'[1]Pt1-DATA'!$C:$C,0),0)","v":7406},{"$f":"IFERROR(MATCH($A38&\"#\"&O$1,'[1]Pt1-DATA'!$C:$C,0),0)","v":7623},{"$f":"IFERROR(MATCH($A38&\"#\"&P$1,'[1]Pt1-DATA'!$C:$C,0),0)","v":0},{"$f":"IFERROR(MATCH($A38&\"#\"&Q$1,'[1]Pt1-DATA'!$C:$C,0),0)","v":0},{"$f":"IFERROR(MATCH($A38&\"#\"&R$1,'[1]Pt1-DATA'!$C:$C,0),0)","v":0},{"$f":"IFERROR(MATCH($A38&\"#\"&S$1,'[1]Pt1-DATA'!$C:$C,0),0)","v":0},{"$f":"IFERROR(MATCH($A38&\"#\"&T$1,'[1]Pt1-DATA'!$C:$C,0),0)","v":11599}]
[555,"Business Jet","Large Jet","Wide body VIP","Boeing BBJ 787","Rolls-Royce Trent 1000","wide body (IMA)",null,true,null,{"$f":"IFERROR(MATCH($A39&\"#\"&K$1,'[1]Pt1-DATA'!$C:$C,0),0)","v":399},null,{"$f":"IFERROR(MATCH($A39&\"#\"&M$1,'[1]Pt1-DATA'!$C:$C,0),0)","v":0},{"$f":"IFERROR(MATCH($A39&\"#\"&N$1,'[1]Pt1-DATA'!$C:$C,0),0)","v":7407},{"$f":"IFERROR(MATCH($A39&\"#\"&O$1,'[1]Pt1-DATA'!$C:$C,0),0)","v":7624},{"$f":"IFERROR(MATCH($A39&\"#\"&P$1,'[1]Pt1-DATA'!$C:$C,0),0)","v":0},{"$f":"IFERROR(MATCH($A39&\"#\"&Q$1,'[1]Pt1-DATA'!$C:$C,0),0)","v":0},{"$f":"IFERROR(MATCH($A39&\"#\"&R$1,'[1]Pt1-DATA'!$C:$C,0),0)","v":0},{"$f":"IFERROR(MATCH($A39&\"#\"&S$1,'[1]Pt1-DATA'!$C:$C,0),0)","v":0},{"$f":"IFERROR(MATCH($A39&\"#\"&T$1,'[1]Pt1-DATA'!$C:$C,0),0)","v":11616}]
[42,"Business Jet","Light Jet","Citation CJ3","Cessna Citation CJ3","Williams FJ44-3A","bizjet",null,true,null,{"$f":"IFERROR(MATCH($A40&\"#\"&K$1,'[1]Pt1-DATA'!$C:$C,0),0)","v":235},null,{"$f":"IFERROR(MATCH($A40&\"#\"&M$1,'[1]Pt1-DATA'!$C:$C,0),0)","v":0},{"$f":"IFERROR(MATCH($A40&\"#\"&N$1,'[1]Pt1-DATA'!$C:$C,0),0)","v":0},{"$f":"IFERROR(MATCH($A40&\"#\"&O$1,'[1]Pt1-DATA'!$C:$C,0),0)","v":0},{"$f":"IFERROR(MATCH($A40&\"#\"&P$1,'[1]Pt1-DATA'!$C:$C,0),0)","v":0},{"$f":"IFERROR(MATCH($A40&\"#\"&Q$1,'[1]Pt1-DATA'!$C:$C,0),0)","v":0},{"$f":"IFERROR(MATCH($A40&\"#\"&R$1,'[1]Pt1-DATA'!$C:$C,0),0)","v":8705},{"$f":"IFERROR(MATCH($A40&\"#\"&S$1,'[1]Pt1-DATA'!$C:$C,0),0)","v":0},{"$f":"IFERROR(MATCH($A40&\"#\"&T$1,'[1]Pt1-DATA'!$C:$C,0),0)","v":0}]
[43,"Business Jet","Light Jet","Citation CJ4","Cessna Citation CJ4","Williams FJ44-4A","bizjet",null,true,null,{"$f":"IFERROR(MATCH($A41&\"#\"&K$1,'[1]Pt1-DATA'!$C:$C,0),0)","v":236},null,{"$f":"IFERROR(MATCH($A41&\"#\"&M$1,'[1]Pt1-DATA'!$C:$C,0),0)","v":0},{"$f":"IFERROR(MATCH($A41&\"#\"&N$1,'[1]Pt1-DATA'!$C:$C,0),0)","v":0},{"$f":"IFERROR(MATCH($A41&\"#\"&O$1,'[1]Pt1-DATA'!$C:$C,0),0)","v":0},{"$f":"IFERROR(MATCH($A41&\"#\"&P$1,'[1]Pt1-DATA'!$C:$C,0),0)","v":0},{"$f":"IFERROR(MATCH($A41&\"#\"&Q$1,'[1]Pt1-DATA'!$C:$C,0),0)","v":0},{"$f":"IFERROR(MATCH($A41&\"#\"&R$1,'[1]Pt1-DATA'!$C:$C,0),0)","v":8706},{"$f":"IFERROR(MATCH($A41&\"#\"&S$1,'[1]Pt1-DATA'!$C:$C,0),0)","v":0},{"$f":"IFERROR(MATCH($A41&\"#\"&T$1,'[1]Pt1-DATA'!$C:$C,0),0)","v":0}]
[39,"Business Jet","Light Jet","Citation V","Cessna Citation Encore","Pratt & Whitney Canada JT15D","bizjet",null,true,null,{"$f":"IFERROR(MATCH($A42&\"#\"&K$1,'[1]Pt1-DATA'!$C:$C,0),0)","v":231},null,{"$f":"IFERROR(MATCH($A42&\"#\"&M$1,'[1]Pt1-DATA'!$C:$C,0),0)","v":0},{"$f":"IFERROR(MATCH($A42&\"#\"&N$1,'[1]Pt1-DATA'!$C:$C,0),0)","v":0},{"$f":"IFERROR(MATCH($A42&\"#\"&O$1,'[1]Pt1-DATA'!$C:$C,0),0)","v":0},{"$f":"IFERROR(MATCH($A42&\"#\"&P$1,'[1]Pt1-DATA'!$C:$C,0),0)","v":0},{"$f":"IFERROR(MATCH($A42&\"#\"&Q$1,'[1]Pt1-DATA'!$C:$C,0),0)","v":0},{"$f":"IFERROR(MATCH($A42&\"#\"&R$1,'[1]Pt1-DATA'!$C:$C,0),0)","v":8702},{"$f":"IFERROR(MATCH($A42&\"#\"&S$1,'[1]Pt1-DATA'!$C:$C,0),0)","v":0},{"$f":"IFERROR(MATCH($A42&\"#\"&T$1,'[1]Pt1-DATA'!$C:$C,0),0)","v":0}]
[30,"Business Jet","Light Jet","Hawker 400","Hawker 400","Pratt & Whitney Canada JT15D","bizjet",null,true,null,{"$f":"IFERROR(MATCH($A43&\"#\"&K$1,'[1]Pt1-DATA'!$C:$C,0),0)","v":232},null,{"$f":"IFERROR(MATCH($A43&\"#\"&M$1,'[1]Pt1-DATA'!$C:$C,0),0)","v":0},{"$f":"IFERROR(MATCH($A43&\"#\"&N$1,'[1]Pt1-DATA'!$C:$C,0),0)","v":0},{"$f":"IFERROR(MATCH($A43&\"#\"&O$1,'[1]Pt1-DATA'!$C:$C,0),0)","v":0},{"$f":"IFERROR(MATCH($A43&\"#\"&P$1,'[1]Pt1-DATA'!$C:$C,0),0)","v":0},{"$f":"IFERROR(MATCH($A43&\"#\"&Q$1,'[1]Pt1-DATA'!$C:$C,0),0)","v":0},{"$f":"IFERROR(MATCH($A43&\"#\"&R$1,'[1]Pt1-DATA'!$C:$C,0),0)","v":8703},{"$f":"IFERROR(MATCH($A43&\"#\"&S$1,'[1]Pt1-DATA'!$C:$C,0),0)","v":0},{"$f":"IFERROR(MATCH($A43&\"#\"&T$1,'[1]Pt1-DATA'!$C:$C,0),0)","v":0}]
[56,"Business Jet","Light Jet","Phenom 300","Embraer Phenom 300","Pratt & Whitney Canada PW535E","bizjet",null,true,null,{"$f":"IFERROR(MATCH($A44&\"#\"&K$1,'[1]Pt1-DATA'!$C:$C,0),0)","v":233},null,{"$f":"IFERROR(MATCH($A44&\"#\"&M$1,'[1]Pt1-DATA'!$C:$C,0),0)","v":0},{"$f":"IFERROR(MATCH($A44&\"#\"&N$1,'[1]Pt1-DATA'!$C:$C,0),0)","v":0},{"$f":"IFERROR(MATCH($A44&\"#\"&O$1,'[1]Pt1-DATA'!$C:$C,0),0)","v":0},{"$f":"IFERROR(MATCH($A44&\"#\"&P$1,'[1]Pt1-DATA'!$C:$C,0),0)","v":0},{"$f":"IFERROR(MATCH($A44&\"#\"&Q$1,'[1]Pt1-DATA'!$C:$C,0),0)","v":0},{"$f":"IFERROR(MATCH($A44&\"#\"&R$1,'[1]Pt1-DATA'!$C:$C,0),0)","v":8701},{"$f":"IFERROR(MATCH($A44&\"#\"&S$1,'[1]Pt1-DATA'!$C:$C,0),0)","v":0},{"$f":"IFERROR(MATCH($A44&\"#\"&T$1,'[1]Pt1-DATA'!$C:$C,0),0)","v":0}]
[641,"Business Jet","Light Jet","Phenom 300X","Embraer Phenom 300X","Pratt & Whitney Canada PW535E","bizjet",null,true,null,{"$f":"IFERROR(MATCH($A45&\"#\"&K$1,'[1]Pt1-DATA'!$C:$C,0),0)","v":234},null,{"$f":"IFERROR(MATCH($A45&\"#\"&M$1,'[1]Pt1-DATA'!$C:$C,0),0)","v":0},{"$f":"IFERROR(MATCH($A45&\"#\"&N$1,'[1]Pt1-DATA'!$C:$C,0),0)","v":0},{"$f":"IFERROR(MATCH($A45&\"#\"&O$1,'[1]Pt1-DATA'!$C:$C,0),0)","v":0},{"$f":"IFERROR(MATCH($A45&\"#\"&P$1,'[1]Pt1-DATA'!$C:$C,0),0)","v":0},{"$f":"IFERROR(MATCH($A45&\"#\"&Q$1,'[1]Pt1-DATA'!$C:$C,0),0)","v":0},{"$f":"IFERROR(MATCH($A45&\"#\"&R$1,'[1]Pt1-DATA'!$C:$C,0),0)","v":8704},{"$f":"IFERROR(MATCH($A45&\"#\"&S$1,'[1]Pt1-DATA'!$C:$C,0),0)","v":0},{"$f":"IFERROR(MATCH($A45&\"#\"&T$1,'[1]Pt1-DATA'!$C:$C,0),0)","v":0}]
[34,"Business Jet","Mid Size Jet","Bombardier Challenger 300/350","Bombardier Challenger 300/350","Honeywell HTF7000 ","bizjet",null,true,null,{"$f":"IFERROR(MATCH($A46&\"#\"&K$1,'[1]Pt1-DATA'!$C:$C,0),0)","v":239},null,{"$f":"IFERROR(MATCH($A46&\"#\"&M$1,'[1]Pt1-DATA'!$C:$C,0),0)","v":0},{"$f":"IFERROR(MATCH($A46&\"#\"&N$1,'[1]Pt1-DATA'!$C:$C,0),0)","v":0},{"$f":"IFERROR(MATCH($A46&\"#\"&O$1,'[1]Pt1-DATA'!$C:$C,0),0)","v":0},{"$f":"IFERROR(MATCH($A46&\"#\"&P$1,'[1]Pt1-DATA'!$C:$C,0),0)","v":0},{"$f":"IFERROR(MATCH($A46&\"#\"&Q$1,'[1]Pt1-DATA'!$C:$C,0),0)","v":0},{"$f":"IFERROR(MATCH($A46&\"#\"&R$1,'[1]Pt1-DATA'!$C:$C,0),0)","v":8707},{"$f":"IFERROR(MATCH($A46&\"#\"&S$1,'[1]Pt1-DATA'!$C:$C,0),0)","v":0},{"$f":"IFERROR(MATCH($A46&\"#\"&T$1,'[1]Pt1-DATA'!$C:$C,0),0)","v":0}]
[649,"Business Jet","Mid Size Jet","Bombardier Challenger 3500","Bombardier Challenger 3500","Honeywell HTF7000 ","bizjet",null,true,null,{"$f":"IFERROR(MATCH($A47&\"#\"&K$1,'[1]Pt1-DATA'!$C:$C,0),0)","v":240},null,{"$f":"IFERROR(MATCH($A47&\"#\"&M$1,'[1]Pt1-DATA'!$C:$C,0),0)","v":0},{"$f":"IFERROR(MATCH($A47&\"#\"&N$1,'[1]Pt1-DATA'!$C:$C,0),0)","v":0},{"$f":"IFERROR(MATCH($A47&\"#\"&O$1,'[1]Pt1-DATA'!$C:$C,0),0)","v":0},{"$f":"IFERROR(MATCH($A47&\"#\"&P$1,'[1]Pt1-DATA'!$C:$C,0),0)","v":0},{"$f":"IFERROR(MATCH($A47&\"#\"&Q$1,'[1]Pt1-DATA'!$C:$C,0),0)","v":0},{"$f":"IFERROR(MATCH($A47&\"#\"&R$1,'[1]Pt1-DATA'!$C:$C,0),0)","v":8708},{"$f":"IFERROR(MATCH($A47&\"#\"&S$1,'[1]Pt1-DATA'!$C:$C,0),0)","v":0},{"$f":"IFERROR(MATCH($A47&\"#\"&T$1,'[1]Pt1-DATA'!$C:$C,0),0)","v":0}]
[46,"Business Jet","Mid Size Jet","Citation Latitude","Cessna Citation Latitude","Pratt & Whitney Canada PW306D","bizjet",null,true,null,{"$f":"IFERROR(MATCH($A48&\"#\"&K$1,'[1]Pt1-DATA'!$C:$C,0),0)","v":241},null,{"$f":"IFERROR(MATCH($A48&\"#\"&M$1,'[1]Pt1-DATA'!$C:$C,0),0)","v":0},{"$f":"IFERROR(MATCH($A48&\"#\"&N$1,'[1]Pt1-DATA'!$C:$C,0),0)","v":0},{"$f":"IFERROR(MATCH($A48&\"#\"&O$1,'[1]Pt1-DATA'!$C:$C,0),0)","v":0},{"$f":"IFERROR(MATCH($A48&\"#\"&P$1,'[1]Pt1-DATA'!$C:$C,0),0)","v":0},{"$f":"IFERROR(MATCH($A48&\"#\"&Q$1,'[1]Pt1-DATA'!$C:$C,0),0)","v":0},{"$f":"IFERROR(MATCH($A48&\"#\"&R$1,'[1]Pt1-DATA'!$C:$C,0),0)","v":8709},{"$f":"IFERROR(MATCH($A48&\"#\"&S$1,'[1]Pt1-DATA'!$C:$C,0),0)","v":0},{"$f":"IFERROR(MATCH($A48&\"#\"&T$1,'[1]Pt1-DATA'!$C:$C,0),0)","v":0}]
[45,"Business Jet","Mid Size Jet","Citation Sovereign","Cessna Citation Sovereign","Pratt & Whitney Canada PW306D","bizjet",null,true,null,{"$f":"IFERROR(MATCH($A49&\"#\"&K$1,'[1]Pt1-DATA'!$C:$C,0),0)","v":242},null,{"$f":"IFERROR(MATCH($A49&\"#\"&M$1,'[1]Pt1-DATA'!$C:$C,0),0)","v":0},{"$f":"IFERROR(MATCH($A49&\"#\"&N$1,'[1]Pt1-DATA'!$C:$C,0),0)","v":0},{"$f":"IFERROR(MATCH($A49&\"#\"&O$1,'[1]Pt1-DATA'!$C:$C,0),0)","v":0},{"$f":"IFERROR(MATCH($A49&\"#\"&P$1,'[1]Pt1-DATA'!$C:$C,0),0)","v":0},{"$f":"IFERROR(MATCH($A49&\"#\"&Q$1,'[1]Pt1-DATA'!$C:$C,0),0)","v":0},{"$f":"IFERROR(MATCH($A49&\"#\"&R$1,'[1]Pt1-DATA'!$C:$C,0),0)","v":8710},{"$f":"IFERROR(MATCH($A49&\"#\"&S$1,'[1]Pt1-DATA'!$C:$C,0),0)","v":0},{"$f":"IFERROR(MATCH($A49&\"#\"&T$1,'[1]Pt1-DATA'!$C:$C,0),0)","v":0}]
[49,"Business Jet","Mid Size Jet","Citation X","Cessna Citation X","Rolls-Royce AE 3007","bizjet",null,true,null,{"$f":"IFERROR(MATCH($A50&\"#\"&K$1,'[1]Pt1-DATA'!$C:$C,0),0)","v":243},null,{"$f":"IFERROR(MATCH($A50&\"#\"&M$1,'[1]Pt1-DATA'!$C:$C,0),0)","v":0},{"$f":"IFERROR(MATCH($A50&\"#\"&N$1,'[1]Pt1-DATA'!$C:$C,0),0)","v":0},{"$f":"IFERROR(MATCH($A50&\"#\"&O$1,'[1]Pt1-DATA'!$C:$C,0),0)","v":0},{"$f":"IFERROR(MATCH($A50&\"#\"&P$1,'[1]Pt1-DATA'!$C:$C,0),0)","v":0},{"$f":"IFERROR(MATCH($A50&\"#\"&Q$1,'[1]Pt1-DATA'!$C:$C,0),0)","v":0},{"$f":"IFERROR(MATCH($A50&\"#\"&R$1,'[1]Pt1-DATA'!$C:$C,0),0)","v":8711},{"$f":"IFERROR(MATCH($A50&\"#\"&S$1,'[1]Pt1-DATA'!$C:$C,0),0)","v":0},{"$f":"IFERROR(MATCH($A50&\"#\"&T$1,'[1]Pt1-DATA'!$C:$C,0),0)","v":0}]
[40,"Business Jet","Mid Size Jet","Citation XLS","Cessna Citation XLS","Pratt & Whitney Canada PW545C","bizjet",null,true,null,{"$f":"IFERROR(MATCH($A51&\"#\"&K$1,'[1]Pt1-DATA'!$C:$C,0),0)","v":244},null,{"$f":"IFERROR(MATCH($A51&\"#\"&M$1,'[1]Pt1-DATA'!$C:$C,0),0)","v":0},{"$f":"IFERROR(MATCH($A51&\"#\"&N$1,'[1]Pt1-DATA'!$C:$C,0),0)","v":0},{"$f":"IFERROR(MATCH($A51&\"#\"&O$1,'[1]Pt1-DATA'!$C:$C,0),0)","v":0},{"$f":"IFERROR(MATCH($A51&\"#\"&P$1,'[1]Pt1-DATA'!$C:$C,0),0)","v":0},{"$f":"IFERROR(MATCH($A51&\"#\"&Q$1,'[1]Pt1-DATA'!$C:$C,0),0)","v":0},{"$f":"IFERROR(MATCH($A51&\"#\"&R$1,'[1]Pt1-DATA'!$C:$C,0),0)","v":8712},{"$f":"IFERROR(MATCH($A51&\"#\"&S$1,'[1]Pt1-DATA'!$C:$C,0),0)","v":0},{"$f":"IFERROR(MATCH($A51&\"#\"&T$1,'[1]Pt1-DATA'!$C:$C,0),0)","v":0}]
[53,"Business Jet","Mid Size Jet","Falcon 2000","Dassault Falcon 2000","Pratt & Whitney Canada PW308A/C","bizjet","IMA",true,null,{"$f":"IFERROR(MATCH($A52&\"#\"&K$1,'[1]Pt1-DATA'!$C:$C,0),0)","v":245},null,{"$f":"IFERROR(MATCH($A52&\"#\"&M$1,'[1]Pt1-DATA'!$C:$C,0),0)","v":0},{"$f":"IFERROR(MATCH($A52&\"#\"&N$1,'[1]Pt1-DATA'!$C:$C,0),0)","v":7380},{"$f":"IFERROR(MATCH($A52&\"#\"&O$1,'[1]Pt1-DATA'!$C:$C,0),0)","v":0},{"$f":"IFERROR(MATCH($A52&\"#\"&P$1,'[1]Pt1-DATA'!$C:$C,0),0)","v":0},{"$f":"IFERROR(MATCH($A52&\"#\"&Q$1,'[1]Pt1-DATA'!$C:$C,0),0)","v":0},{"$f":"IFERROR(MATCH($A52&\"#\"&R$1,'[1]Pt1-DATA'!$C:$C,0),0)","v":8713},{"$f":"IFERROR(MATCH($A52&\"#\"&S$1,'[1]Pt1-DATA'!$C:$C,0),0)","v":0},{"$f":"IFERROR(MATCH($A52&\"#\"&T$1,'[1]Pt1-DATA'!$C:$C,0),0)","v":0}]
[640,"Business Jet","Mid Size Jet","Falcon 2X","Dassault Falcon 2X","Pratt & Whitney Canada PW308A/C","bizjet",null,true,null,{"$f":"IFERROR(MATCH($A53&\"#\"&K$1,'[1]Pt1-DATA'!$C:$C,0),0)","v":246},null,{"$f":"IFERROR(MATCH($A53&\"#\"&M$1,'[1]Pt1-DATA'!$C:$C,0),0)","v":0},{"$f":"IFERROR(MATCH($A53&\"#\"&N$1,'[1]Pt1-DATA'!$C:$C,0),0)","v":0},{"$f":"IFERROR(MATCH($A53&\"#\"&O$1,'[1]Pt1-DATA'!$C:$C,0),0)","v":0},{"$f":"IFERROR(MATCH($A53&\"#\"&P$1,'[1]Pt1-DATA'!$C:$C,0),0)","v":0},{"$f":"IFERROR(MATCH($A53&\"#\"&Q$1,'[1]Pt1-DATA'!$C:$C,0),0)","v":0},{"$f":"IFERROR(MATCH($A53&\"#\"&R$1,'[1]Pt1-DATA'!$C:$C,0),0)","v":8714},{"$f":"IFERROR(MATCH($A53&\"#\"&S$1,'[1]Pt1-DATA'!$C:$C,0),0)","v":0},{"$f":"IFERROR(MATCH($A53&\"#\"&T$1,'[1]Pt1-DATA'!$C:$C,0),0)","v":0}]
[64,"Business Jet","Mid Size Jet","G100","Gulfstream G100","Honeywell TFE731","bizjet",null,true,null,{"$f":"IFERROR(MATCH($A54&\"#\"&K$1,'[1]Pt1-DATA'!$C:$C,0),0)","v":247},null,{"$f":"IFERROR(MATCH($A54&\"#\"&M$1,'[1]Pt1-DATA'!$C:$C,0),0)","v":0},{"$f":"IFERROR(MATCH($A54&\"#\"&N$1,'[1]Pt1-DATA'!$C:$C,0),0)","v":0},{"$f":"IFERROR(MATCH($A54&\"#\"&O$1,'[1]Pt1-DATA'!$C:$C,0),0)","v":0},{"$f":"IFERROR(MATCH($A54&\"#\"&P$1,'[1]Pt1-DATA'!$C:$C,0),0)","v":0},{"$f":"IFERROR(MATCH($A54&\"#\"&Q$1,'[1]Pt1-DATA'!$C:$C,0),0)","v":0},{"$f":"IFERROR(MATCH($A54&\"#\"&R$1,'[1]Pt1-DATA'!$C:$C,0),0)","v":8715},{"$f":"IFERROR(MATCH($A54&\"#\"&S$1,'[1]Pt1-DATA'!$C:$C,0),0)","v":0},{"$f":"IFERROR(MATCH($A54&\"#\"&T$1,'[1]Pt1-DATA'!$C:$C,0),0)","v":0}]
[454,"Business Jet","Mid Size Jet","G280","Gulfstream G280","Honeywell HTF7000 ","bizjet","IMA",true,null,{"$f":"IFERROR(MATCH($A55&\"#\"&K$1,'[1]Pt1-DATA'!$C:$C,0),0)","v":248},null,{"$f":"IFERROR(MATCH($A55&\"#\"&M$1,'[1]Pt1-DATA'!$C:$C,0),0)","v":0},{"$f":"IFERROR(MATCH($A55&\"#\"&N$1,'[1]Pt1-DATA'!$C:$C,0),0)","v":7378},{"$f":"IFERROR(MATCH($A55&\"#\"&O$1,'[1]Pt1-DATA'!$C:$C,0),0)","v":0},{"$f":"IFERROR(MATCH($A55&\"#\"&P$1,'[1]Pt1-DATA'!$C:$C,0),0)","v":0},{"$f":"IFERROR(MATCH($A55&\"#\"&Q$1,'[1]Pt1-DATA'!$C:$C,0),0)","v":0},{"$f":"IFERROR(MATCH($A55&\"#\"&R$1,'[1]Pt1-DATA'!$C:$C,0),0)","v":8716},{"$f":"IFERROR(MATCH($A55&\"#\"&S$1,'[1]Pt1-DATA'!$C:$C,0),0)","v":0},{"$f":"IFERROR(MATCH($A55&\"#\"&T$1,'[1]Pt1-DATA'!$C:$C,0),0)","v":0}]
[642,"Business Jet","Mid Size Jet","G285X","Gulfstream G285X","Honeywell HTF7000 ","bizjet",null,true,null,{"$f":"IFERROR(MATCH($A56&\"#\"&K$1,'[1]Pt1-DATA'!$C:$C,0),0)","v":256},null,{"$f":"IFERROR(MATCH($A56&\"#\"&M$1,'[1]Pt1-DATA'!$C:$C,0),0)","v":0},{"$f":"IFERROR(MATCH($A56&\"#\"&N$1,'[1]Pt1-DATA'!$C:$C,0),0)","v":7379},{"$f":"IFERROR(MATCH($A56&\"#\"&O$1,'[1]Pt1-DATA'!$C:$C,0),0)","v":0},{"$f":"IFERROR(MATCH($A56&\"#\"&P$1,'[1]Pt1-DATA'!$C:$C,0),0)","v":0},{"$f":"IFERROR(MATCH($A56&\"#\"&Q$1,'[1]Pt1-DATA'!$C:$C,0),0)","v":0},{"$f":"IFERROR(MATCH($A56&\"#\"&R$1,'[1]Pt1-DATA'!$C:$C,0),0)","v":8724},{"$f":"IFERROR(MATCH($A56&\"#\"&S$1,'[1]Pt1-DATA'!$C:$C,0),0)","v":0},{"$f":"IFERROR(MATCH($A56&\"#\"&T$1,'[1]Pt1-DATA'!$C:$C,0),0)","v":0}]
[33,"Business Jet","Mid Size Jet","Hawker 4000","Hawker 4000","Pratt & Whitney Canada PW308A/C","bizjet",null,true,null,{"$f":"IFERROR(MATCH($A57&\"#\"&K$1,'[1]Pt1-DATA'!$C:$C,0),0)","v":249},null,{"$f":"IFERROR(MATCH($A57&\"#\"&M$1,'[1]Pt1-DATA'!$C:$C,0),0)","v":0},{"$f":"IFERROR(MATCH($A57&\"#\"&N$1,'[1]Pt1-DATA'!$C:$C,0),0)","v":0},{"$f":"IFERROR(MATCH($A57&\"#\"&O$1,'[1]Pt1-DATA'!$C:$C,0),0)","v":0},{"$f":"IFERROR(MATCH($A57&\"#\"&P$1,'[1]Pt1-DATA'!$C:$C,0),0)","v":0},{"$f":"IFERROR(MATCH($A57&\"#\"&Q$1,'[1]Pt1-DATA'!$C:$C,0),0)","v":0},{"$f":"IFERROR(MATCH($A57&\"#\"&R$1,'[1]Pt1-DATA'!$C:$C,0),0)","v":8717},{"$f":"IFERROR(MATCH($A57&\"#\"&S$1,'[1]Pt1-DATA'!$C:$C,0),0)","v":0},{"$f":"IFERROR(MATCH($A57&\"#\"&T$1,'[1]Pt1-DATA'!$C:$C,0),0)","v":0}]
[32,"Business Jet","Mid Size Jet","Hawker 750/850/900","Hawker 750/850/900","Honeywell TFE731","bizjet",null,true,null,{"$f":"IFERROR(MATCH($A58&\"#\"&K$1,'[1]Pt1-DATA'!$C:$C,0),0)","v":250},null,{"$f":"IFERROR(MATCH($A58&\"#\"&M$1,'[1]Pt1-DATA'!$C:$C,0),0)","v":0},{"$f":"IFERROR(MATCH($A58&\"#\"&N$1,'[1]Pt1-DATA'!$C:$C,0),0)","v":0},{"$f":"IFERROR(MATCH($A58&\"#\"&O$1,'[1]Pt1-DATA'!$C:$C,0),0)","v":0},{"$f":"IFERROR(MATCH($A58&\"#\"&P$1,'[1]Pt1-DATA'!$C:$C,0),0)","v":0},{"$f":"IFERROR(MATCH($A58&\"#\"&Q$1,'[1]Pt1-DATA'!$C:$C,0),0)","v":0},{"$f":"IFERROR(MATCH($A58&\"#\"&R$1,'[1]Pt1-DATA'!$C:$C,0),0)","v":8718},{"$f":"IFERROR(MATCH($A58&\"#\"&S$1,'[1]Pt1-DATA'!$C:$C,0),0)","v":0},{"$f":"IFERROR(MATCH($A58&\"#\"&T$1,'[1]Pt1-DATA'!$C:$C,0),0)","v":0}]
[68,"Business Jet","Mid Size Jet","Learjet 60","Learjet 60","Pratt & Whitney Canada PW305A","bizjet",null,true,null,{"$f":"IFERROR(MATCH($A59&\"#\"&K$1,'[1]Pt1-DATA'!$C:$C,0),0)","v":251},null,{"$f":"IFERROR(MATCH($A59&\"#\"&M$1,'[1]Pt1-DATA'!$C:$C,0),0)","v":0},{"$f":"IFERROR(MATCH($A59&\"#\"&N$1,'[1]Pt1-DATA'!$C:$C,0),0)","v":0},{"$f":"IFERROR(MATCH($A59&\"#\"&O$1,'[1]Pt1-DATA'!$C:$C,0),0)","v":0},{"$f":"IFERROR(MATCH($A59&\"#\"&P$1,'[1]Pt1-DATA'!$C:$C,0),0)","v":0},{"$f":"IFERROR(MATCH($A59&\"#\"&Q$1,'[1]Pt1-DATA'!$C:$C,0),0)","v":0},{"$f":"IFERROR(MATCH($A59&\"#\"&R$1,'[1]Pt1-DATA'!$C:$C,0),0)","v":8719},{"$f":"IFERROR(MATCH($A59&\"#\"&S$1,'[1]Pt1-DATA'!$C:$C,0),0)","v":0},{"$f":"IFERROR(MATCH($A59&\"#\"&T$1,'[1]Pt1-DATA'!$C:$C,0),0)","v":0}]
[67,"Business Jet","Mid Size Jet","Learjet 70/75","Learjet 70/75","Honeywell TFE731","bizjet",null,true,null,{"$f":"IFERROR(MATCH($A60&\"#\"&K$1,'[1]Pt1-DATA'!$C:$C,0),0)","v":252},null,{"$f":"IFERROR(MATCH($A60&\"#\"&M$1,'[1]Pt1-DATA'!$C:$C,0),0)","v":0},{"$f":"IFERROR(MATCH($A60&\"#\"&N$1,'[1]Pt1-DATA'!$C:$C,0),0)","v":0},{"$f":"IFERROR(MATCH($A60&\"#\"&O$1,'[1]Pt1-DATA'!$C:$C,0),0)","v":0},{"$f":"IFERROR(MATCH($A60&\"#\"&P$1,'[1]Pt1-DATA'!$C:$C,0),0)","v":0},{"$f":"IFERROR(MATCH($A60&\"#\"&Q$1,'[1]Pt1-DATA'!$C:$C,0),0)","v":0},{"$f":"IFERROR(MATCH($A60&\"#\"&R$1,'[1]Pt1-DATA'!$C:$C,0),0)","v":8720},{"$f":"IFERROR(MATCH($A60&\"#\"&S$1,'[1]Pt1-DATA'!$C:$C,0),0)","v":0},{"$f":"IFERROR(MATCH($A60&\"#\"&T$1,'[1]Pt1-DATA'!$C:$C,0),0)","v":0}]
[57,"Business Jet","Mid Size Jet","Legacy 450/Praetor 500","Legacy 450/Praetor 500","Honeywell HTF7000 ","bizjet",null,true,null,{"$f":"IFERROR(MATCH($A61&\"#\"&K$1,'[1]Pt1-DATA'!$C:$C,0),0)","v":253},null,{"$f":"IFERROR(MATCH($A61&\"#\"&M$1,'[1]Pt1-DATA'!$C:$C,0),0)","v":0},{"$f":"IFERROR(MATCH($A61&\"#\"&N$1,'[1]Pt1-DATA'!$C:$C,0),0)","v":0},{"$f":"IFERROR(MATCH($A61&\"#\"&O$1,'[1]Pt1-DATA'!$C:$C,0),0)","v":0},{"$f":"IFERROR(MATCH($A61&\"#\"&P$1,'[1]Pt1-DATA'!$C:$C,0),0)","v":0},{"$f":"IFERROR(MATCH($A61&\"#\"&Q$1,'[1]Pt1-DATA'!$C:$C,0),0)","v":0},{"$f":"IFERROR(MATCH($A61&\"#\"&R$1,'[1]Pt1-DATA'!$C:$C,0),0)","v":8721},{"$f":"IFERROR(MATCH($A61&\"#\"&S$1,'[1]Pt1-DATA'!$C:$C,0),0)","v":0},{"$f":"IFERROR(MATCH($A61&\"#\"&T$1,'[1]Pt1-DATA'!$C:$C,0),0)","v":0}]
[58,"Business Jet","Mid Size Jet","Legacy 500/Praetor 600","Legacy 500/Praetor 600","Honeywell HTF7000 ","bizjet",null,true,null,{"$f":"IFERROR(MATCH($A62&\"#\"&K$1,'[1]Pt1-DATA'!$C:$C,0),0)","v":254},null,{"$f":"IFERROR(MATCH($A62&\"#\"&M$1,'[1]Pt1-DATA'!$C:$C,0),0)","v":0},{"$f":"IFERROR(MATCH($A62&\"#\"&N$1,'[1]Pt1-DATA'!$C:$C,0),0)","v":0},{"$f":"IFERROR(MATCH($A62&\"#\"&O$1,'[1]Pt1-DATA'!$C:$C,0),0)","v":0},{"$f":"IFERROR(MATCH($A62&\"#\"&P$1,'[1]Pt1-DATA'!$C:$C,0),0)","v":0},{"$f":"IFERROR(MATCH($A62&\"#\"&Q$1,'[1]Pt1-DATA'!$C:$C,0),0)","v":0},{"$f":"IFERROR(MATCH($A62&\"#\"&R$1,'[1]Pt1-DATA'!$C:$C,0),0)","v":8722},{"$f":"IFERROR(MATCH($A62&\"#\"&S$1,'[1]Pt1-DATA'!$C:$C,0),0)","v":0},{"$f":"IFERROR(MATCH($A62&\"#\"&T$1,'[1]Pt1-DATA'!$C:$C,0),0)","v":0}]
[71,"Business Jet","Mid Size Jet","PC-24","Pilatus PC-24","Williams FJ44-4A","bizjet",null,true,null,{"$f":"IFERROR(MATCH($A63&\"#\"&K$1,'[1]Pt1-DATA'!$C:$C,0),0)","v":255},null,{"$f":"IFERROR(MATCH($A63&\"#\"&M$1,'[1]Pt1-DATA'!$C:$C,0),0)","v":0},{"$f":"IFERROR(MATCH($A63&\"#\"&N$1,'[1]Pt1-DATA'!$C:$C,0),0)","v":0},{"$f":"IFERROR(MATCH($A63&\"#\"&O$1,'[1]Pt1-DATA'!$C:$C,0),0)","v":0},{"$f":"IFERROR(MATCH($A63&\"#\"&P$1,'[1]Pt1-DATA'!$C:$C,0),0)","v":0},{"$f":"IFERROR(MATCH($A63&\"#\"&Q$1,'[1]Pt1-DATA'!$C:$C,0),0)","v":0},{"$f":"IFERROR(MATCH($A63&\"#\"&R$1,'[1]Pt1-DATA'!$C:$C,0),0)","v":8723},{"$f":"IFERROR(MATCH($A63&\"#\"&S$1,'[1]Pt1-DATA'!$C:$C,0),0)","v":0},{"$f":"IFERROR(MATCH($A63&\"#\"&T$1,'[1]Pt1-DATA'!$C:$C,0),0)","v":0}]
[550,"Business Jet","Very Light Jet","Cirrus Vision Jet SF50","Cirrus Vision Jet SF50","Williams FJ33","bizjet",null,true,null,{"$f":"IFERROR(MATCH($A64&\"#\"&K$1,'[1]Pt1-DATA'!$C:$C,0),0)","v":223},null,{"$f":"IFERROR(MATCH($A64&\"#\"&M$1,'[1]Pt1-DATA'!$C:$C,0),0)","v":0},{"$f":"IFERROR(MATCH($A64&\"#\"&N$1,'[1]Pt1-DATA'!$C:$C,0),0)","v":0},{"$f":"IFERROR(MATCH($A64&\"#\"&O$1,'[1]Pt1-DATA'!$C:$C,0),0)","v":0},{"$f":"IFERROR(MATCH($A64&\"#\"&P$1,'[1]Pt1-DATA'!$C:$C,0),0)","v":0},{"$f":"IFERROR(MATCH($A64&\"#\"&Q$1,'[1]Pt1-DATA'!$C:$C,0),0)","v":0},{"$f":"IFERROR(MATCH($A64&\"#\"&R$1,'[1]Pt1-DATA'!$C:$C,0),0)","v":8693},{"$f":"IFERROR(MATCH($A64&\"#\"&S$1,'[1]Pt1-DATA'!$C:$C,0),0)","v":0},{"$f":"IFERROR(MATCH($A64&\"#\"&T$1,'[1]Pt1-DATA'!$C:$C,0),0)","v":0}]
[41,"Business Jet","Very Light Jet","Citation M2","Cessna Citation M2","Williams FJ44-1A","bizjet",null,true,null,{"$f":"IFERROR(MATCH($A65&\"#\"&K$1,'[1]Pt1-DATA'!$C:$C,0),0)","v":224},null,{"$f":"IFERROR(MATCH($A65&\"#\"&M$1,'[1]Pt1-DATA'!$C:$C,0),0)","v":0},{"$f":"IFERROR(MATCH($A65&\"#\"&N$1,'[1]Pt1-DATA'!$C:$C,0),0)","v":0},{"$f":"IFERROR(MATCH($A65&\"#\"&O$1,'[1]Pt1-DATA'!$C:$C,0),0)","v":0},{"$f":"IFERROR(MATCH($A65&\"#\"&P$1,'[1]Pt1-DATA'!$C:$C,0),0)","v":0},{"$f":"IFERROR(MATCH($A65&\"#\"&Q$1,'[1]Pt1-DATA'!$C:$C,0),0)","v":0},{"$f":"IFERROR(MATCH($A65&\"#\"&R$1,'[1]Pt1-DATA'!$C:$C,0),0)","v":8694},{"$f":"IFERROR(MATCH($A65&\"#\"&S$1,'[1]Pt1-DATA'!$C:$C,0),0)","v":0},{"$f":"IFERROR(MATCH($A65&\"#\"&T$1,'[1]Pt1-DATA'!$C:$C,0),0)","v":0}]
[44,"Business Jet","Very Light Jet","Citation Mustang","Cessna Citation Mustang","Pratt & Whitney Canada PW615F","bizjet",null,true,null,{"$f":"IFERROR(MATCH($A66&\"#\"&K$1,'[1]Pt1-DATA'!$C:$C,0),0)","v":225},null,{"$f":"IFERROR(MATCH($A66&\"#\"&M$1,'[1]Pt1-DATA'!$C:$C,0),0)","v":0},{"$f":"IFERROR(MATCH($A66&\"#\"&N$1,'[1]Pt1-DATA'!$C:$C,0),0)","v":0},{"$f":"IFERROR(MATCH($A66&\"#\"&O$1,'[1]Pt1-DATA'!$C:$C,0),0)","v":0},{"$f":"IFERROR(MATCH($A66&\"#\"&P$1,'[1]Pt1-DATA'!$C:$C,0),0)","v":0},{"$f":"IFERROR(MATCH($A66&\"#\"&Q$1,'[1]Pt1-DATA'!$C:$C,0),0)","v":0},{"$f":"IFERROR(MATCH($A66&\"#\"&R$1,'[1]Pt1-DATA'!$C:$C,0),0)","v":8695},{"$f":"IFERROR(MATCH($A66&\"#\"&S$1,'[1]Pt1-DATA'!$C:$C,0),0)","v":0},{"$f":"IFERROR(MATCH($A66&\"#\"&T$1,'[1]Pt1-DATA'!$C:$C,0),0)","v":0}]
[70,"Business Jet","Very Light Jet","Eclipse 550","Eclipse 550","Pratt & Whitney Canada PW610F","bizjet",null,{"$f":"SUM(K67:T67)>0","v":true},null,{"$f":"IFERROR(MATCH($A67&\"#\"&K$1,'[1]Pt1-DATA'!$C:$C,0),0)","v":226},null,{"$f":"IFERROR(MATCH($A67&\"#\"&M$1,'[1]Pt1-DATA'!$C:$C,0),0)","v":0},{"$f":"IFERROR(MATCH($A67&\"#\"&N$1,'[1]Pt1-DATA'!$C:$C,0),0)","v":0},{"$f":"IFERROR(MATCH($A67&\"#\"&O$1,'[1]Pt1-DATA'!$C:$C,0),0)","v":0},{"$f":"IFERROR(MATCH($A67&\"#\"&P$1,'[1]Pt1-DATA'!$C:$C,0),0)","v":0},{"$f":"IFERROR(MATCH($A67&\"#\"&Q$1,'[1]Pt1-DATA'!$C:$C,0),0)","v":0},{"$f":"IFERROR(MATCH($A67&\"#\"&R$1,'[1]Pt1-DATA'!$C:$C,0),0)","v":8696},{"$f":"IFERROR(MATCH($A67&\"#\"&S$1,'[1]Pt1-DATA'!$C:$C,0),0)","v":0},{"$f":"IFERROR(MATCH($A67&\"#\"&T$1,'[1]Pt1-DATA'!$C:$C,0),0)","v":0}]
[590,"Business Jet","Very Light Jet","HondaJet","Honda HA-2600 HondaJet","Williams FJ44-4C","bizjet",null,true,null,{"$f":"IFERROR(MATCH($A68&\"#\"&K$1,'[1]Pt1-DATA'!$C:$C,0),0)","v":227},null,{"$f":"IFERROR(MATCH($A68&\"#\"&M$1,'[1]Pt1-DATA'!$C:$C,0),0)","v":0},{"$f":"IFERROR(MATCH($A68&\"#\"&N$1,'[1]Pt1-DATA'!$C:$C,0),0)","v":0},{"$f":"IFERROR(MATCH($A68&\"#\"&O$1,'[1]Pt1-DATA'!$C:$C,0),0)","v":0},{"$f":"IFERROR(MATCH($A68&\"#\"&P$1,'[1]Pt1-DATA'!$C:$C,0),0)","v":0},{"$f":"IFERROR(MATCH($A68&\"#\"&Q$1,'[1]Pt1-DATA'!$C:$C,0),0)","v":0},{"$f":"IFERROR(MATCH($A68&\"#\"&R$1,'[1]Pt1-DATA'!$C:$C,0),0)","v":8697},{"$f":"IFERROR(MATCH($A68&\"#\"&S$1,'[1]Pt1-DATA'!$C:$C,0),0)","v":0},{"$f":"IFERROR(MATCH($A68&\"#\"&T$1,'[1]Pt1-DATA'!$C:$C,0),0)","v":0}]
[66,"Business Jet","Very Light Jet","HondaJet","Honda HA-420 HondaJet","GE Honda HF120","bizjet",null,true,null,{"$f":"IFERROR(MATCH($A69&\"#\"&K$1,'[1]Pt1-DATA'!$C:$C,0),0)","v":228},null,{"$f":"IFERROR(MATCH($A69&\"#\"&M$1,'[1]Pt1-DATA'!$C:$C,0),0)","v":0},{"$f":"IFERROR(MATCH($A69&\"#\"&N$1,'[1]Pt1-DATA'!$C:$C,0),0)","v":0},{"$f":"IFERROR(MATCH($A69&\"#\"&O$1,'[1]Pt1-DATA'!$C:$C,0),0)","v":0},{"$f":"IFERROR(MATCH($A69&\"#\"&P$1,'[1]Pt1-DATA'!$C:$C,0),0)","v":0},{"$f":"IFERROR(MATCH($A69&\"#\"&Q$1,'[1]Pt1-DATA'!$C:$C,0),0)","v":0},{"$f":"IFERROR(MATCH($A69&\"#\"&R$1,'[1]Pt1-DATA'!$C:$C,0),0)","v":8698},{"$f":"IFERROR(MATCH($A69&\"#\"&S$1,'[1]Pt1-DATA'!$C:$C,0),0)","v":0},{"$f":"IFERROR(MATCH($A69&\"#\"&T$1,'[1]Pt1-DATA'!$C:$C,0),0)","v":0}]
[180,"Business Jet","Very Light Jet","Nextant 400XT","Nextant Aerospace - Nextant 400XT Aircraft","Williams FJ44-3A","bizjet",null,true,null,{"$f":"IFERROR(MATCH($A70&\"#\"&K$1,'[1]Pt1-DATA'!$C:$C,0),0)","v":229},null,{"$f":"IFERROR(MATCH($A70&\"#\"&M$1,'[1]Pt1-DATA'!$C:$C,0),0)","v":0},{"$f":"IFERROR(MATCH($A70&\"#\"&N$1,'[1]Pt1-DATA'!$C:$C,0),0)","v":0},{"$f":"IFERROR(MATCH($A70&\"#\"&O$1,'[1]Pt1-DATA'!$C:$C,0),0)","v":0},{"$f":"IFERROR(MATCH($A70&\"#\"&P$1,'[1]Pt1-DATA'!$C:$C,0),0)","v":0},{"$f":"IFERROR(MATCH($A70&\"#\"&Q$1,'[1]Pt1-DATA'!$C:$C,0),0)","v":0},{"$f":"IFERROR(MATCH($A70&\"#\"&R$1,'[1]Pt1-DATA'!$C:$C,0),0)","v":8699},{"$f":"IFERROR(MATCH($A70&\"#\"&S$1,'[1]Pt1-DATA'!$C:$C,0),0)","v":0},{"$f":"IFERROR(MATCH($A70&\"#\"&T$1,'[1]Pt1-DATA'!$C:$C,0),0)","v":0}]
[55,"Business Jet","Very Light Jet","Phenom 100","Embraer Phenom 100","Pratt & Whitney Canada PW617F","bizjet",null,true,null,{"$f":"IFERROR(MATCH($A71&\"#\"&K$1,'[1]Pt1-DATA'!$C:$C,0),0)","v":230},null,{"$f":"IFERROR(MATCH($A71&\"#\"&M$1,'[1]Pt1-DATA'!$C:$C,0),0)","v":0},{"$f":"IFERROR(MATCH($A71&\"#\"&N$1,'[1]Pt1-DATA'!$C:$C,0),0)","v":0},{"$f":"IFERROR(MATCH($A71&\"#\"&O$1,'[1]Pt1-DATA'!$C:$C,0),0)","v":0},{"$f":"IFERROR(MATCH($A71&\"#\"&P$1,'[1]Pt1-DATA'!$C:$C,0),0)","v":0},{"$f":"IFERROR(MATCH($A71&\"#\"&Q$1,'[1]Pt1-DATA'!$C:$C,0),0)","v":0},{"$f":"IFERROR(MATCH($A71&\"#\"&R$1,'[1]Pt1-DATA'!$C:$C,0),0)","v":8700},{"$f":"IFERROR(MATCH($A71&\"#\"&S$1,'[1]Pt1-DATA'!$C:$C,0),0)","v":0},{"$f":"IFERROR(MATCH($A71&\"#\"&T$1,'[1]Pt1-DATA'!$C:$C,0),0)","v":0}]
[643,"Fighters and Jet Trainers","Attack","BAES/Leonardo Tempest","BAES/Leonardo Tempest","Rolls-Royce Tempest","mil fighter",null,true,null,{"$f":"IFERROR(MATCH($A72&\"#\"&K$1,'[1]Pt1-DATA'!$C:$C,0),0)","v":0},null,{"$f":"IFERROR(MATCH($A72&\"#\"&M$1,'[1]Pt1-DATA'!$C:$C,0),0)","v":0},{"$f":"IFERROR(MATCH($A72&\"#\"&N$1,'[1]Pt1-DATA'!$C:$C,0),0)","v":0},{"$f":"IFERROR(MATCH($A72&\"#\"&O$1,'[1]Pt1-DATA'!$C:$C,0),0)","v":7610},{"$f":"IFERROR(MATCH($A72&\"#\"&P$1,'[1]Pt1-DATA'!$C:$C,0),0)","v":7650},{"$f":"IFERROR(MATCH($A72&\"#\"&Q$1,'[1]Pt1-DATA'!$C:$C,0),0)","v":0},{"$f":"IFERROR(MATCH($A72&\"#\"&R$1,'[1]Pt1-DATA'!$C:$C,0),0)","v":0},{"$f":"IFERROR(MATCH($A72&\"#\"&S$1,'[1]Pt1-DATA'!$C:$C,0),0)","v":0},{"$f":"IFERROR(MATCH($A72&\"#\"&T$1,'[1]Pt1-DATA'!$C:$C,0),0)","v":0}]
[179,"Fighters and Jet Trainers","Attack","Boeing/Saab T-X program","Boeing T-7","General Electric F404","mil trainer",null,true,null,{"$f":"IFERROR(MATCH($A73&\"#\"&K$1,'[1]Pt1-DATA'!$C:$C,0),0)","v":0},null,{"$f":"IFERROR(MATCH($A73&\"#\"&M$1,'[1]Pt1-DATA'!$C:$C,0),0)","v":0},{"$f":"IFERROR(MATCH($A73&\"#\"&N$1,'[1]Pt1-DATA'!$C:$C,0),0)","v":0},{"$f":"IFERROR(MATCH($A73&\"#\"&O$1,'[1]Pt1-DATA'!$C:$C,0),0)","v":7611},{"$f":"IFERROR(MATCH($A73&\"#\"&P$1,'[1]Pt1-DATA'!$C:$C,0),0)","v":7651},{"$f":"IFERROR(MATCH($A73&\"#\"&Q$1,'[1]Pt1-DATA'!$C:$C,0),0)","v":0},{"$f":"IFERROR(MATCH($A73&\"#\"&R$1,'[1]Pt1-DATA'!$C:$C,0),0)","v":0},{"$f":"IFERROR(MATCH($A73&\"#\"&S$1,'[1]Pt1-DATA'!$C:$C,0),0)","v":0},{"$f":"IFERROR(MATCH($A73&\"#\"&T$1,'[1]Pt1-DATA'!$C:$C,0),0)","v":0}]
[141,"Fighters and Jet Trainers","Attack","Dassault Rafale","Dassault Rafale","Snecma M88","mil fighter",null,true,null,{"$f":"IFERROR(MATCH($A74&\"#\"&K$1,'[1]Pt1-DATA'!$C:$C,0),0)","v":0},null,{"$f":"IFERROR(MATCH($A74&\"#\"&M$1,'[1]Pt1-DATA'!$C:$C,0),0)","v":0},{"$f":"IFERROR(MATCH($A74&\"#\"&N$1,'[1]Pt1-DATA'!$C:$C,0),0)","v":0},{"$f":"IFERROR(MATCH($A74&\"#\"&O$1,'[1]Pt1-DATA'!$C:$C,0),0)","v":7612},{"$f":"IFERROR(MATCH($A74&\"#\"&P$1,'[1]Pt1-DATA'!$C:$C,0),0)","v":7652},{"$f":"IFERROR(MATCH($A74&\"#\"&Q$1,'[1]Pt1-DATA'!$C:$C,0),0)","v":0},{"$f":"IFERROR(MATCH($A74&\"#\"&R$1,'[1]Pt1-DATA'!$C:$C,0),0)","v":0},{"$f":"IFERROR(MATCH($A74&\"#\"&S$1,'[1]Pt1-DATA'!$C:$C,0),0)","v":0},{"$f":"IFERROR(MATCH($A74&\"#\"&T$1,'[1]Pt1-DATA'!$C:$C,0),0)","v":0}]
[142,"Fighters and Jet Trainers","Attack","Eurofighter Typhoon","Eurofighter Typhoon","Eurojet EJ200","mil fighter",null,true,null,{"$f":"IFERROR(MATCH($A75&\"#\"&K$1,'[1]Pt1-DATA'!$C:$C,0),0)","v":0},null,{"$f":"IFERROR(MATCH($A75&\"#\"&M$1,'[1]Pt1-DATA'!$C:$C,0),0)","v":0},{"$f":"IFERROR(MATCH($A75&\"#\"&N$1,'[1]Pt1-DATA'!$C:$C,0),0)","v":0},{"$f":"IFERROR(MATCH($A75&\"#\"&O$1,'[1]Pt1-DATA'!$C:$C,0),0)","v":7613},{"$f":"IFERROR(MATCH($A75&\"#\"&P$1,'[1]Pt1-DATA'!$C:$C,0),0)","v":7653},{"$f":"IFERROR(MATCH($A75&\"#\"&Q$1,'[1]Pt1-DATA'!$C:$C,0),0)","v":0},{"$f":"IFERROR(MATCH($A75&\"#\"&R$1,'[1]Pt1-DATA'!$C:$C,0),0)","v":0},{"$f":"IFERROR(MATCH($A75&\"#\"&S$1,'[1]Pt1-DATA'!$C:$C,0),0)","v":0},{"$f":"IFERROR(MATCH($A75&\"#\"&T$1,'[1]Pt1-DATA'!$C:$C,0),0)","v":0}]
[139,"Fighters and Jet Trainers","Attack","F-15","McDonnell Douglas F-15 Eagle","General Electric F110","mil fighter",null,true,null,{"$f":"IFERROR(MATCH($A76&\"#\"&K$1,'[1]Pt1-DATA'!$C:$C,0),0)","v":0},null,{"$f":"IFERROR(MATCH($A76&\"#\"&M$1,'[1]Pt1-DATA'!$C:$C,0),0)","v":0},{"$f":"IFERROR(MATCH($A76&\"#\"&N$1,'[1]Pt1-DATA'!$C:$C,0),0)","v":0},{"$f":"IFERROR(MATCH($A76&\"#\"&O$1,'[1]Pt1-DATA'!$C:$C,0),0)","v":7617},{"$f":"IFERROR(MATCH($A76&\"#\"&P$1,'[1]Pt1-DATA'!$C:$C,0),0)","v":7657},{"$f":"IFERROR(MATCH($A76&\"#\"&Q$1,'[1]Pt1-DATA'!$C:$C,0),0)","v":0},{"$f":"IFERROR(MATCH($A76&\"#\"&R$1,'[1]Pt1-DATA'!$C:$C,0),0)","v":0},{"$f":"IFERROR(MATCH($A76&\"#\"&S$1,'[1]Pt1-DATA'!$C:$C,0),0)","v":0},{"$f":"IFERROR(MATCH($A76&\"#\"&T$1,'[1]Pt1-DATA'!$C:$C,0),0)","v":0}]
[505,"Fighters and Jet Trainers","Attack","F-15","McDonnell Douglas F-15 Eagle","Pratt & Whitney F100","mil fighter",null,true,null,{"$f":"IFERROR(MATCH($A77&\"#\"&K$1,'[1]Pt1-DATA'!$C:$C,0),0)","v":0},null,{"$f":"IFERROR(MATCH($A77&\"#\"&M$1,'[1]Pt1-DATA'!$C:$C,0),0)","v":0},{"$f":"IFERROR(MATCH($A77&\"#\"&N$1,'[1]Pt1-DATA'!$C:$C,0),0)","v":0},{"$f":"IFERROR(MATCH($A77&\"#\"&O$1,'[1]Pt1-DATA'!$C:$C,0),0)","v":7614},{"$f":"IFERROR(MATCH($A77&\"#\"&P$1,'[1]Pt1-DATA'!$C:$C,0),0)","v":7654},{"$f":"IFERROR(MATCH($A77&\"#\"&Q$1,'[1]Pt1-DATA'!$C:$C,0),0)","v":0},{"$f":"IFERROR(MATCH($A77&\"#\"&R$1,'[1]Pt1-DATA'!$C:$C,0),0)","v":0},{"$f":"IFERROR(MATCH($A77&\"#\"&S$1,'[1]Pt1-DATA'!$C:$C,0),0)","v":0},{"$f":"IFERROR(MATCH($A77&\"#\"&T$1,'[1]Pt1-DATA'!$C:$C,0),0)","v":0}]
[144,"Fighters and Jet Trainers","Attack","F-16","General Dynamics F-16 Fighting Falcon","General Electric F110","mil fighter",null,true,null,{"$f":"IFERROR(MATCH($A78&\"#\"&K$1,'[1]Pt1-DATA'!$C:$C,0),0)","v":0},null,{"$f":"IFERROR(MATCH($A78&\"#\"&M$1,'[1]Pt1-DATA'!$C:$C,0),0)","v":0},{"$f":"IFERROR(MATCH($A78&\"#\"&N$1,'[1]Pt1-DATA'!$C:$C,0),0)","v":0},{"$f":"IFERROR(MATCH($A78&\"#\"&O$1,'[1]Pt1-DATA'!$C:$C,0),0)","v":7615},{"$f":"IFERROR(MATCH($A78&\"#\"&P$1,'[1]Pt1-DATA'!$C:$C,0),0)","v":7655},{"$f":"IFERROR(MATCH($A78&\"#\"&Q$1,'[1]Pt1-DATA'!$C:$C,0),0)","v":0},{"$f":"IFERROR(MATCH($A78&\"#\"&R$1,'[1]Pt1-DATA'!$C:$C,0),0)","v":0},{"$f":"IFERROR(MATCH($A78&\"#\"&S$1,'[1]Pt1-DATA'!$C:$C,0),0)","v":0},{"$f":"IFERROR(MATCH($A78&\"#\"&T$1,'[1]Pt1-DATA'!$C:$C,0),0)","v":0}]
[506,"Fighters and Jet Trainers","Attack","F-16","General Dynamics F-16 Fighting Falcon","Pratt & Whitney F100","mil fighter",null,true,null,{"$f":"IFERROR(MATCH($A79&\"#\"&K$1,'[1]Pt1-DATA'!$C:$C,0),0)","v":0},null,{"$f":"IFERROR(MATCH($A79&\"#\"&M$1,'[1]Pt1-DATA'!$C:$C,0),0)","v":0},{"$f":"IFERROR(MATCH($A79&\"#\"&N$1,'[1]Pt1-DATA'!$C:$C,0),0)","v":0},{"$f":"IFERROR(MATCH($A79&\"#\"&O$1,'[1]Pt1-DATA'!$C:$C,0),0)","v":7616},{"$f":"IFERROR(MATCH($A79&\"#\"&P$1,'[1]Pt1-DATA'!$C:$C,0),0)","v":7656},{"$f":"IFERROR(MATCH($A79&\"#\"&Q$1,'[1]Pt1-DATA'!$C:$C,0),0)","v":0},{"$f":"IFERROR(MATCH($A79&\"#\"&R$1,'[1]Pt1-DATA'!$C:$C,0),0)","v":0},{"$f":"IFERROR(MATCH($A79&\"#\"&S$1,'[1]Pt1-DATA'!$C:$C,0),0)","v":0},{"$f":"IFERROR(MATCH($A79&\"#\"&T$1,'[1]Pt1-DATA'!$C:$C,0),0)","v":0}]
[637,"Fighters and Jet Trainers","Attack","F-18","F-18 A/D","General Electric F404","mil fighter",null,true,null,{"$f":"IFERROR(MATCH($A80&\"#\"&K$1,'[1]Pt1-DATA'!$C:$C,0),0)","v":0},null,{"$f":"IFERROR(MATCH($A80&\"#\"&M$1,'[1]Pt1-DATA'!$C:$C,0),0)","v":0},{"$f":"IFERROR(MATCH($A80&\"#\"&N$1,'[1]Pt1-DATA'!$C:$C,0),0)","v":0},{"$f":"IFERROR(MATCH($A80&\"#\"&O$1,'[1]Pt1-DATA'!$C:$C,0),0)","v":7601},{"$f":"IFERROR(MATCH($A80&\"#\"&P$1,'[1]Pt1-DATA'!$C:$C,0),0)","v":7641},{"$f":"IFERROR(MATCH($A80&\"#\"&Q$1,'[1]Pt1-DATA'!$C:$C,0),0)","v":0},{"$f":"IFERROR(MATCH($A80&\"#\"&R$1,'[1]Pt1-DATA'!$C:$C,0),0)","v":0},{"$f":"IFERROR(MATCH($A80&\"#\"&S$1,'[1]Pt1-DATA'!$C:$C,0),0)","v":0},{"$f":"IFERROR(MATCH($A80&\"#\"&T$1,'[1]Pt1-DATA'!$C:$C,0),0)","v":0}]
[140,"Fighters and Jet Trainers","Attack","F-18","F-18 Super Hornet","General Electric F414","mil fighter",null,true,null,{"$f":"IFERROR(MATCH($A81&\"#\"&K$1,'[1]Pt1-DATA'!$C:$C,0),0)","v":0},null,{"$f":"IFERROR(MATCH($A81&\"#\"&M$1,'[1]Pt1-DATA'!$C:$C,0),0)","v":0},{"$f":"IFERROR(MATCH($A81&\"#\"&N$1,'[1]Pt1-DATA'!$C:$C,0),0)","v":0},{"$f":"IFERROR(MATCH($A81&\"#\"&O$1,'[1]Pt1-DATA'!$C:$C,0),0)","v":7602},{"$f":"IFERROR(MATCH($A81&\"#\"&P$1,'[1]Pt1-DATA'!$C:$C,0),0)","v":7642},{"$f":"IFERROR(MATCH($A81&\"#\"&Q$1,'[1]Pt1-DATA'!$C:$C,0),0)","v":0},{"$f":"IFERROR(MATCH($A81&\"#\"&R$1,'[1]Pt1-DATA'!$C:$C,0),0)","v":0},{"$f":"IFERROR(MATCH($A81&\"#\"&S$1,'[1]Pt1-DATA'!$C:$C,0),0)","v":0},{"$f":"IFERROR(MATCH($A81&\"#\"&T$1,'[1]Pt1-DATA'!$C:$C,0),0)","v":0}]
[148,"Fighters and Jet Trainers","Attack","Gripen","Saab JAS 39 Gripen","General Electric F414","mil fighter",null,true,null,{"$f":"IFERROR(MATCH($A82&\"#\"&K$1,'[1]Pt1-DATA'!$C:$C,0),0)","v":0},null,{"$f":"IFERROR(MATCH($A82&\"#\"&M$1,'[1]Pt1-DATA'!$C:$C,0),0)","v":0},{"$f":"IFERROR(MATCH($A82&\"#\"&N$1,'[1]Pt1-DATA'!$C:$C,0),0)","v":0},{"$f":"IFERROR(MATCH($A82&\"#\"&O$1,'[1]Pt1-DATA'!$C:$C,0),0)","v":7603},{"$f":"IFERROR(MATCH($A82&\"#\"&P$1,'[1]Pt1-DATA'!$C:$C,0),0)","v":7643},{"$f":"IFERROR(MATCH($A82&\"#\"&Q$1,'[1]Pt1-DATA'!$C:$C,0),0)","v":0},{"$f":"IFERROR(MATCH($A82&\"#\"&R$1,'[1]Pt1-DATA'!$C:$C,0),0)","v":0},{"$f":"IFERROR(MATCH($A82&\"#\"&S$1,'[1]Pt1-DATA'!$C:$C,0),0)","v":0},{"$f":"IFERROR(MATCH($A82&\"#\"&T$1,'[1]Pt1-DATA'!$C:$C,0),0)","v":0}]
[584,"Fighters and Jet Trainers","Attack","KAI KF-X","KAI KF-21","General Electric F414","mil fighter",null,true,null,{"$f":"IFERROR(MATCH($A83&\"#\"&K$1,'[1]Pt1-DATA'!$C:$C,0),0)","v":0},null,{"$f":"IFERROR(MATCH($A83&\"#\"&M$1,'[1]Pt1-DATA'!$C:$C,0),0)","v":0},{"$f":"IFERROR(MATCH($A83&\"#\"&N$1,'[1]Pt1-DATA'!$C:$C,0),0)","v":0},{"$f":"IFERROR(MATCH($A83&\"#\"&O$1,'[1]Pt1-DATA'!$C:$C,0),0)","v":7604},{"$f":"IFERROR(MATCH($A83&\"#\"&P$1,'[1]Pt1-DATA'!$C:$C,0),0)","v":7644},{"$f":"IFERROR(MATCH($A83&\"#\"&Q$1,'[1]Pt1-DATA'!$C:$C,0),0)","v":0},{"$f":"IFERROR(MATCH($A83&\"#\"&R$1,'[1]Pt1-DATA'!$C:$C,0),0)","v":0},{"$f":"IFERROR(MATCH($A83&\"#\"&S$1,'[1]Pt1-DATA'!$C:$C,0),0)","v":0},{"$f":"IFERROR(MATCH($A83&\"#\"&T$1,'[1]Pt1-DATA'!$C:$C,0),0)","v":0}]
[176,"Fighters and Jet Trainers","Attack","KAI T-50 Golden Eagle","KAI T-50 Golden Eagle","General Electric F404","mil fighter",null,true,null,{"$f":"IFERROR(MATCH($A84&\"#\"&K$1,'[1]Pt1-DATA'!$C:$C,0),0)","v":0},null,{"$f":"IFERROR(MATCH($A84&\"#\"&M$1,'[1]Pt1-DATA'!$C:$C,0),0)","v":0},{"$f":"IFERROR(MATCH($A84&\"#\"&N$1,'[1]Pt1-DATA'!$C:$C,0),0)","v":0},{"$f":"IFERROR(MATCH($A84&\"#\"&O$1,'[1]Pt1-DATA'!$C:$C,0),0)","v":7605},{"$f":"IFERROR(MATCH($A84&\"#\"&P$1,'[1]Pt1-DATA'!$C:$C,0),0)","v":7645},{"$f":"IFERROR(MATCH($A84&\"#\"&Q$1,'[1]Pt1-DATA'!$C:$C,0),0)","v":0},{"$f":"IFERROR(MATCH($A84&\"#\"&R$1,'[1]Pt1-DATA'!$C:$C,0),0)","v":0},{"$f":"IFERROR(MATCH($A84&\"#\"&S$1,'[1]Pt1-DATA'!$C:$C,0),0)","v":0},{"$f":"IFERROR(MATCH($A84&\"#\"&T$1,'[1]Pt1-DATA'!$C:$C,0),0)","v":0}]
[147,"Fighters and Jet Trainers","Attack","Mitsubishi F-2","Mitsubishi F-2","General Electric F110","mil fighter",null,true,null,{"$f":"IFERROR(MATCH($A85&\"#\"&K$1,'[1]Pt1-DATA'!$C:$C,0),0)","v":0},null,{"$f":"IFERROR(MATCH($A85&\"#\"&M$1,'[1]Pt1-DATA'!$C:$C,0),0)","v":0},{"$f":"IFERROR(MATCH($A85&\"#\"&N$1,'[1]Pt1-DATA'!$C:$C,0),0)","v":0},{"$f":"IFERROR(MATCH($A85&\"#\"&O$1,'[1]Pt1-DATA'!$C:$C,0),0)","v":7606},{"$f":"IFERROR(MATCH($A85&\"#\"&P$1,'[1]Pt1-DATA'!$C:$C,0),0)","v":7646},{"$f":"IFERROR(MATCH($A85&\"#\"&Q$1,'[1]Pt1-DATA'!$C:$C,0),0)","v":0},{"$f":"IFERROR(MATCH($A85&\"#\"&R$1,'[1]Pt1-DATA'!$C:$C,0),0)","v":0},{"$f":"IFERROR(MATCH($A85&\"#\"&S$1,'[1]Pt1-DATA'!$C:$C,0),0)","v":0},{"$f":"IFERROR(MATCH($A85&\"#\"&T$1,'[1]Pt1-DATA'!$C:$C,0),0)","v":0}]
[585,"Fighters and Jet Trainers","Attack","TAI TF-X","TAI TF-X","General Electric F110","mil fighter",null,true,null,{"$f":"IFERROR(MATCH($A86&\"#\"&K$1,'[1]Pt1-DATA'!$C:$C,0),0)","v":0},null,{"$f":"IFERROR(MATCH($A86&\"#\"&M$1,'[1]Pt1-DATA'!$C:$C,0),0)","v":0},{"$f":"IFERROR(MATCH($A86&\"#\"&N$1,'[1]Pt1-DATA'!$C:$C,0),0)","v":0},{"$f":"IFERROR(MATCH($A86&\"#\"&O$1,'[1]Pt1-DATA'!$C:$C,0),0)","v":7607},{"$f":"IFERROR(MATCH($A86&\"#\"&P$1,'[1]Pt1-DATA'!$C:$C,0),0)","v":7647},{"$f":"IFERROR(MATCH($A86&\"#\"&Q$1,'[1]Pt1-DATA'!$C:$C,0),0)","v":0},{"$f":"IFERROR(MATCH($A86&\"#\"&R$1,'[1]Pt1-DATA'!$C:$C,0),0)","v":0},{"$f":"IFERROR(MATCH($A86&\"#\"&S$1,'[1]Pt1-DATA'!$C:$C,0),0)","v":0},{"$f":"IFERROR(MATCH($A86&\"#\"&T$1,'[1]Pt1-DATA'!$C:$C,0),0)","v":0}]
[578,"Fighters and Jet Trainers","Fighters and Jet Trainers","Aero L-39NG","Aero Vodochody L-39NG","Williams FJ44-4M","mil fighter",null,false,null,{"$f":"IFERROR(MATCH($A87&\"#\"&K$1,'[1]Pt1-DATA'!$C:$C,0),0)","v":0},null,{"$f":"IFERROR(MATCH($A87&\"#\"&M$1,'[1]Pt1-DATA'!$C:$C,0),0)","v":0},{"$f":"IFERROR(MATCH($A87&\"#\"&N$1,'[1]Pt1-DATA'!$C:$C,0),0)","v":0},{"$f":"IFERROR(MATCH($A87&\"#\"&O$1,'[1]Pt1-DATA'!$C:$C,0),0)","v":0},{"$f":"IFERROR(MATCH($A87&\"#\"&P$1,'[1]Pt1-DATA'!$C:$C,0),0)","v":0},{"$f":"IFERROR(MATCH($A87&\"#\"&Q$1,'[1]Pt1-DATA'!$C:$C,0),0)","v":0},{"$f":"IFERROR(MATCH($A87&\"#\"&R$1,'[1]Pt1-DATA'!$C:$C,0),0)","v":0},{"$f":"IFERROR(MATCH($A87&\"#\"&S$1,'[1]Pt1-DATA'!$C:$C,0),0)","v":0},{"$f":"IFERROR(MATCH($A87&\"#\"&T$1,'[1]Pt1-DATA'!$C:$C,0),0)","v":0}]
[675,"Fighters and Jet Trainers","Fighters and Jet Trainers","AIDC T-5","AIDC T-5","Honeywell/ITEC F124","mil trainer",null,false,null,{"$f":"IFERROR(MATCH($A88&\"#\"&K$1,'[1]Pt1-DATA'!$C:$C,0),0)","v":0},null,{"$f":"IFERROR(MATCH($A88&\"#\"&M$1,'[1]Pt1-DATA'!$C:$C,0),0)","v":0},{"$f":"IFERROR(MATCH($A88&\"#\"&N$1,'[1]Pt1-DATA'!$C:$C,0),0)","v":0},{"$f":"IFERROR(MATCH($A88&\"#\"&O$1,'[1]Pt1-DATA'!$C:$C,0),0)","v":0},{"$f":"IFERROR(MATCH($A88&\"#\"&P$1,'[1]Pt1-DATA'!$C:$C,0),0)","v":0},{"$f":"IFERROR(MATCH($A88&\"#\"&Q$1,'[1]Pt1-DATA'!$C:$C,0),0)","v":0},{"$f":"IFERROR(MATCH($A88&\"#\"&R$1,'[1]Pt1-DATA'!$C:$C,0),0)","v":0},{"$f":"IFERROR(MATCH($A88&\"#\"&S$1,'[1]Pt1-DATA'!$C:$C,0),0)","v":0},{"$f":"IFERROR(MATCH($A88&\"#\"&T$1,'[1]Pt1-DATA'!$C:$C,0),0)","v":0}]
[171,"Fighters and Jet Trainers","Fighters and Jet Trainers","FMA IA 63 Pampa","FMA IA 63 Pampa","Honeywell TFE731","mil fighter",null,false,null,{"$f":"IFERROR(MATCH($A89&\"#\"&K$1,'[1]Pt1-DATA'!$C:$C,0),0)","v":0},null,{"$f":"IFERROR(MATCH($A89&\"#\"&M$1,'[1]Pt1-DATA'!$C:$C,0),0)","v":0},{"$f":"IFERROR(MATCH($A89&\"#\"&N$1,'[1]Pt1-DATA'!$C:$C,0),0)","v":0},{"$f":"IFERROR(MATCH($A89&\"#\"&O$1,'[1]Pt1-DATA'!$C:$C,0),0)","v":0},{"$f":"IFERROR(MATCH($A89&\"#\"&P$1,'[1]Pt1-DATA'!$C:$C,0),0)","v":0},{"$f":"IFERROR(MATCH($A89&\"#\"&Q$1,'[1]Pt1-DATA'!$C:$C,0),0)","v":0},{"$f":"IFERROR(MATCH($A89&\"#\"&R$1,'[1]Pt1-DATA'!$C:$C,0),0)","v":0},{"$f":"IFERROR(MATCH($A89&\"#\"&S$1,'[1]Pt1-DATA'!$C:$C,0),0)","v":0},{"$f":"IFERROR(MATCH($A89&\"#\"&T$1,'[1]Pt1-DATA'!$C:$C,0),0)","v":0}]
[167,"Fighters and Jet Trainers","Fighters and Jet Trainers","Hawk","BAE Systems Hawk","Rolls-Royce Turbomeca Adour","mil fighter",null,false,null,{"$f":"IFERROR(MATCH($A90&\"#\"&K$1,'[1]Pt1-DATA'!$C:$C,0),0)","v":0},null,{"$f":"IFERROR(MATCH($A90&\"#\"&M$1,'[1]Pt1-DATA'!$C:$C,0),0)","v":0},{"$f":"IFERROR(MATCH($A90&\"#\"&N$1,'[1]Pt1-DATA'!$C:$C,0),0)","v":0},{"$f":"IFERROR(MATCH($A90&\"#\"&O$1,'[1]Pt1-DATA'!$C:$C,0),0)","v":0},{"$f":"IFERROR(MATCH($A90&\"#\"&P$1,'[1]Pt1-DATA'!$C:$C,0),0)","v":0},{"$f":"IFERROR(MATCH($A90&\"#\"&Q$1,'[1]Pt1-DATA'!$C:$C,0),0)","v":0},{"$f":"IFERROR(MATCH($A90&\"#\"&R$1,'[1]Pt1-DATA'!$C:$C,0),0)","v":0},{"$f":"IFERROR(MATCH($A90&\"#\"&S$1,'[1]Pt1-DATA'!$C:$C,0),0)","v":0},{"$f":"IFERROR(MATCH($A90&\"#\"&T$1,'[1]Pt1-DATA'!$C:$C,0),0)","v":0}]
[174,"Fighters and Jet Trainers","Fighters and Jet Trainers","HJT-36 Sitara","HAL HJT-36 Sitara","NPO Saturn AL-551","mil fighter",null,false,null,{"$f":"IFERROR(MATCH($A91&\"#\"&K$1,'[1]Pt1-DATA'!$C:$C,0),0)","v":0},null,{"$f":"IFERROR(MATCH($A91&\"#\"&M$1,'[1]Pt1-DATA'!$C:$C,0),0)","v":0},{"$f":"IFERROR(MATCH($A91&\"#\"&N$1,'[1]Pt1-DATA'!$C:$C,0),0)","v":0},{"$f":"IFERROR(MATCH($A91&\"#\"&O$1,'[1]Pt1-DATA'!$C:$C,0),0)","v":0},{"$f":"IFERROR(MATCH($A91&\"#\"&P$1,'[1]Pt1-DATA'!$C:$C,0),0)","v":0},{"$f":"IFERROR(MATCH($A91&\"#\"&Q$1,'[1]Pt1-DATA'!$C:$C,0),0)","v":0},{"$f":"IFERROR(MATCH($A91&\"#\"&R$1,'[1]Pt1-DATA'!$C:$C,0),0)","v":0},{"$f":"IFERROR(MATCH($A91&\"#\"&S$1,'[1]Pt1-DATA'!$C:$C,0),0)","v":0},{"$f":"IFERROR(MATCH($A91&\"#\"&T$1,'[1]Pt1-DATA'!$C:$C,0),0)","v":0}]
[173,"Fighters and Jet Trainers","Fighters and Jet Trainers","Hongdu K-8","Hongdu K-8","Honeywell TFE731","mil fighter",null,false,null,{"$f":"IFERROR(MATCH($A92&\"#\"&K$1,'[1]Pt1-DATA'!$C:$C,0),0)","v":0},null,{"$f":"IFERROR(MATCH($A92&\"#\"&M$1,'[1]Pt1-DATA'!$C:$C,0),0)","v":0},{"$f":"IFERROR(MATCH($A92&\"#\"&N$1,'[1]Pt1-DATA'!$C:$C,0),0)","v":0},{"$f":"IFERROR(MATCH($A92&\"#\"&O$1,'[1]Pt1-DATA'!$C:$C,0),0)","v":0},{"$f":"IFERROR(MATCH($A92&\"#\"&P$1,'[1]Pt1-DATA'!$C:$C,0),0)","v":0},{"$f":"IFERROR(MATCH($A92&\"#\"&Q$1,'[1]Pt1-DATA'!$C:$C,0),0)","v":0},{"$f":"IFERROR(MATCH($A92&\"#\"&R$1,'[1]Pt1-DATA'!$C:$C,0),0)","v":0},{"$f":"IFERROR(MATCH($A92&\"#\"&S$1,'[1]Pt1-DATA'!$C:$C,0),0)","v":0},{"$f":"IFERROR(MATCH($A92&\"#\"&T$1,'[1]Pt1-DATA'!$C:$C,0),0)","v":0}]
[165,"Fighters and Jet Trainers","Fighters and Jet Trainers","M-345","Aermacchi M-345","Williams FJ44-4M","mil fighter",null,false,null,{"$f":"IFERROR(MATCH($A93&\"#\"&K$1,'[1]Pt1-DATA'!$C:$C,0),0)","v":0},null,{"$f":"IFERROR(MATCH($A93&\"#\"&M$1,'[1]Pt1-DATA'!$C:$C,0),0)","v":0},{"$f":"IFERROR(MATCH($A93&\"#\"&N$1,'[1]Pt1-DATA'!$C:$C,0),0)","v":0},{"$f":"IFERROR(MATCH($A93&\"#\"&O$1,'[1]Pt1-DATA'!$C:$C,0),0)","v":0},{"$f":"IFERROR(MATCH($A93&\"#\"&P$1,'[1]Pt1-DATA'!$C:$C,0),0)","v":0},{"$f":"IFERROR(MATCH($A93&\"#\"&Q$1,'[1]Pt1-DATA'!$C:$C,0),0)","v":0},{"$f":"IFERROR(MATCH($A93&\"#\"&R$1,'[1]Pt1-DATA'!$C:$C,0),0)","v":0},{"$f":"IFERROR(MATCH($A93&\"#\"&S$1,'[1]Pt1-DATA'!$C:$C,0),0)","v":0},{"$f":"IFERROR(MATCH($A93&\"#\"&T$1,'[1]Pt1-DATA'!$C:$C,0),0)","v":0}]
[166,"Fighters and Jet Trainers","Fighters and Jet Trainers","M-346","Aermacchi M-346","Honeywell/ITEC F124","mil fighter",null,false,null,{"$f":"IFERROR(MATCH($A94&\"#\"&K$1,'[1]Pt1-DATA'!$C:$C,0),0)","v":0},null,{"$f":"IFERROR(MATCH($A94&\"#\"&M$1,'[1]Pt1-DATA'!$C:$C,0),0)","v":0},{"$f":"IFERROR(MATCH($A94&\"#\"&N$1,'[1]Pt1-DATA'!$C:$C,0),0)","v":0},{"$f":"IFERROR(MATCH($A94&\"#\"&O$1,'[1]Pt1-DATA'!$C:$C,0),0)","v":0},{"$f":"IFERROR(MATCH($A94&\"#\"&P$1,'[1]Pt1-DATA'!$C:$C,0),0)","v":0},{"$f":"IFERROR(MATCH($A94&\"#\"&Q$1,'[1]Pt1-DATA'!$C:$C,0),0)","v":0},{"$f":"IFERROR(MATCH($A94&\"#\"&R$1,'[1]Pt1-DATA'!$C:$C,0),0)","v":0},{"$f":"IFERROR(MATCH($A94&\"#\"&S$1,'[1]Pt1-DATA'!$C:$C,0),0)","v":0},{"$f":"IFERROR(MATCH($A94&\"#\"&T$1,'[1]Pt1-DATA'!$C:$C,0),0)","v":0}]
[168,"Fighters and Jet Trainers","Fighters and Jet Trainers","T-45","McDonnell Douglas T-45 Goshawk","Rolls-Royce Turbomeca Adour","mil trainer",null,false,null,{"$f":"IFERROR(MATCH($A95&\"#\"&K$1,'[1]Pt1-DATA'!$C:$C,0),0)","v":0},null,{"$f":"IFERROR(MATCH($A95&\"#\"&M$1,'[1]Pt1-DATA'!$C:$C,0),0)","v":0},{"$f":"IFERROR(MATCH($A95&\"#\"&N$1,'[1]Pt1-DATA'!$C:$C,0),0)","v":0},{"$f":"IFERROR(MATCH($A95&\"#\"&O$1,'[1]Pt1-DATA'!$C:$C,0),0)","v":0},{"$f":"IFERROR(MATCH($A95&\"#\"&P$1,'[1]Pt1-DATA'!$C:$C,0),0)","v":0},{"$f":"IFERROR(MATCH($A95&\"#\"&Q$1,'[1]Pt1-DATA'!$C:$C,0),0)","v":0},{"$f":"IFERROR(MATCH($A95&\"#\"&R$1,'[1]Pt1-DATA'!$C:$C,0),0)","v":0},{"$f":"IFERROR(MATCH($A95&\"#\"&S$1,'[1]Pt1-DATA'!$C:$C,0),0)","v":0},{"$f":"IFERROR(MATCH($A95&\"#\"&T$1,'[1]Pt1-DATA'!$C:$C,0),0)","v":0}]
[143,"Fighters and Jet Trainers","Fighters and Jet Trainers","Tejas","HAL Tejas","General Electric F404","mil fighter",null,false,null,{"$f":"IFERROR(MATCH($A96&\"#\"&K$1,'[1]Pt1-DATA'!$C:$C,0),0)","v":0},null,{"$f":"IFERROR(MATCH($A96&\"#\"&M$1,'[1]Pt1-DATA'!$C:$C,0),0)","v":0},{"$f":"IFERROR(MATCH($A96&\"#\"&N$1,'[1]Pt1-DATA'!$C:$C,0),0)","v":0},{"$f":"IFERROR(MATCH($A96&\"#\"&O$1,'[1]Pt1-DATA'!$C:$C,0),0)","v":0},{"$f":"IFERROR(MATCH($A96&\"#\"&P$1,'[1]Pt1-DATA'!$C:$C,0),0)","v":0},{"$f":"IFERROR(MATCH($A96&\"#\"&Q$1,'[1]Pt1-DATA'!$C:$C,0),0)","v":0},{"$f":"IFERROR(MATCH($A96&\"#\"&R$1,'[1]Pt1-DATA'!$C:$C,0),0)","v":0},{"$f":"IFERROR(MATCH($A96&\"#\"&S$1,'[1]Pt1-DATA'!$C:$C,0),0)","v":0},{"$f":"IFERROR(MATCH($A96&\"#\"&T$1,'[1]Pt1-DATA'!$C:$C,0),0)","v":0}]
[149,"Fighters and Jet Trainers","Stealth","B-21","Northrop Grumman B-21 Raider","Pratt & Whitney F135","mil fighter",null,true,null,{"$f":"IFERROR(MATCH($A97&\"#\"&K$1,'[1]Pt1-DATA'!$C:$C,0),0)","v":0},null,{"$f":"IFERROR(MATCH($A97&\"#\"&M$1,'[1]Pt1-DATA'!$C:$C,0),0)","v":0},{"$f":"IFERROR(MATCH($A97&\"#\"&N$1,'[1]Pt1-DATA'!$C:$C,0),0)","v":0},{"$f":"IFERROR(MATCH($A97&\"#\"&O$1,'[1]Pt1-DATA'!$C:$C,0),0)","v":7608},{"$f":"IFERROR(MATCH($A97&\"#\"&P$1,'[1]Pt1-DATA'!$C:$C,0),0)","v":7648},{"$f":"IFERROR(MATCH($A97&\"#\"&Q$1,'[1]Pt1-DATA'!$C:$C,0),0)","v":0},{"$f":"IFERROR(MATCH($A97&\"#\"&R$1,'[1]Pt1-DATA'!$C:$C,0),0)","v":0},{"$f":"IFERROR(MATCH($A97&\"#\"&S$1,'[1]Pt1-DATA'!$C:$C,0),0)","v":0},{"$f":"IFERROR(MATCH($A97&\"#\"&T$1,'[1]Pt1-DATA'!$C:$C,0),0)","v":0}]
[145,"Fighters and Jet Trainers","Stealth","F-22","Lockheed Martin F-22 Raptor","Pratt & Whitney F119-PW-100","mil fighter","IMA",true,null,{"$f":"IFERROR(MATCH($A98&\"#\"&K$1,'[1]Pt1-DATA'!$C:$C,0),0)","v":0},null,{"$f":"IFERROR(MATCH($A98&\"#\"&M$1,'[1]Pt1-DATA'!$C:$C,0),0)","v":0},{"$f":"IFERROR(MATCH($A98&\"#\"&N$1,'[1]Pt1-DATA'!$C:$C,0),0)","v":0},{"$f":"IFERROR(MATCH($A98&\"#\"&O$1,'[1]Pt1-DATA'!$C:$C,0),0)","v":7609},{"$f":"IFERROR(MATCH($A98&\"#\"&P$1,'[1]Pt1-DATA'!$C:$C,0),0)","v":7649},{"$f":"IFERROR(MATCH($A98&\"#\"&Q$1,'[1]Pt1-DATA'!$C:$C,0),0)","v":0},{"$f":"IFERROR(MATCH($A98&\"#\"&R$1,'[1]Pt1-DATA'!$C:$C,0),0)","v":0},{"$f":"IFERROR(MATCH($A98&\"#\"&S$1,'[1]Pt1-DATA'!$C:$C,0),0)","v":0},{"$f":"IFERROR(MATCH($A98&\"#\"&T$1,'[1]Pt1-DATA'!$C:$C,0),0)","v":0}]
[146,"Fighters and Jet Trainers","Stealth","F-35","Lockheed Martin F-35 Lightning II","Pratt & Whitney F135","mil fighter",null,true,null,{"$f":"IFERROR(MATCH($A99&\"#\"&K$1,'[1]Pt1-DATA'!$C:$C,0),0)","v":0},null,{"$f":"IFERROR(MATCH($A99&\"#\"&M$1,'[1]Pt1-DATA'!$C:$C,0),0)","v":0},{"$f":"IFERROR(MATCH($A99&\"#\"&N$1,'[1]Pt1-DATA'!$C:$C,0),0)","v":0},{"$f":"IFERROR(MATCH($A99&\"#\"&O$1,'[1]Pt1-DATA'!$C:$C,0),0)","v":7640},{"$f":"IFERROR(MATCH($A99&\"#\"&P$1,'[1]Pt1-DATA'!$C:$C,0),0)","v":7658},{"$f":"IFERROR(MATCH($A99&\"#\"&Q$1,'[1]Pt1-DATA'!$C:$C,0),0)","v":0},{"$f":"IFERROR(MATCH($A99&\"#\"&R$1,'[1]Pt1-DATA'!$C:$C,0),0)","v":0},{"$f":"IFERROR(MATCH($A99&\"#\"&S$1,'[1]Pt1-DATA'!$C:$C,0),0)","v":0},{"$f":"IFERROR(MATCH($A99&\"#\"&T$1,'[1]Pt1-DATA'!$C:$C,0),0)","v":0}]
[565,"Freighter","Large Freighters","A330","Airbus A330-743L Beluga XL","Rolls-Royce Trent 700","wide body (non IMA)",null,true,null,{"$f":"IFERROR(MATCH($A100&\"#\"&K$1,'[1]Pt1-DATA'!$C:$C,0),0)","v":380},null,{"$f":"IFERROR(MATCH($A100&\"#\"&M$1,'[1]Pt1-DATA'!$C:$C,0),0)","v":0},{"$f":"IFERROR(MATCH($A100&\"#\"&N$1,'[1]Pt1-DATA'!$C:$C,0),0)","v":0},{"$f":"IFERROR(MATCH($A100&\"#\"&O$1,'[1]Pt1-DATA'!$C:$C,0),0)","v":0},{"$f":"IFERROR(MATCH($A100&\"#\"&P$1,'[1]Pt1-DATA'!$C:$C,0),0)","v":0},{"$f":"IFERROR(MATCH($A100&\"#\"&Q$1,'[1]Pt1-DATA'!$C:$C,0),0)","v":0},{"$f":"IFERROR(MATCH($A100&\"#\"&R$1,'[1]Pt1-DATA'!$C:$C,0),0)","v":0},{"$f":"IFERROR(MATCH($A100&\"#\"&S$1,'[1]Pt1-DATA'!$C:$C,0),0)","v":0},{"$f":"IFERROR(MATCH($A100&\"#\"&T$1,'[1]Pt1-DATA'!$C:$C,0),0)","v":11659}]
[644,"Freighter","Large Freighters","A350","Airbus A350F","Rolls-Royce Trent XWB-97","wide body (IMA)",null,true,null,{"$f":"IFERROR(MATCH($A101&\"#\"&K$1,'[1]Pt1-DATA'!$C:$C,0),0)","v":381},null,{"$f":"IFERROR(MATCH($A101&\"#\"&M$1,'[1]Pt1-DATA'!$C:$C,0),0)","v":0},{"$f":"IFERROR(MATCH($A101&\"#\"&N$1,'[1]Pt1-DATA'!$C:$C,0),0)","v":0},{"$f":"IFERROR(MATCH($A101&\"#\"&O$1,'[1]Pt1-DATA'!$C:$C,0),0)","v":0},{"$f":"IFERROR(MATCH($A101&\"#\"&P$1,'[1]Pt1-DATA'!$C:$C,0),0)","v":0},{"$f":"IFERROR(MATCH($A101&\"#\"&Q$1,'[1]Pt1-DATA'!$C:$C,0),0)","v":0},{"$f":"IFERROR(MATCH($A101&\"#\"&R$1,'[1]Pt1-DATA'!$C:$C,0),0)","v":0},{"$f":"IFERROR(MATCH($A101&\"#\"&S$1,'[1]Pt1-DATA'!$C:$C,0),0)","v":0},{"$f":"IFERROR(MATCH($A101&\"#\"&T$1,'[1]Pt1-DATA'!$C:$C,0),0)","v":11660}]
[592,"Freighter","Large Freighters","Boeing 747","Boeing 747-400CF","General Electric CF6-80C2","wide body (non IMA)",null,true,null,{"$f":"IFERROR(MATCH($A102&\"#\"&K$1,'[1]Pt1-DATA'!$C:$C,0),0)","v":382},null,{"$f":"IFERROR(MATCH($A102&\"#\"&M$1,'[1]Pt1-DATA'!$C:$C,0),0)","v":0},{"$f":"IFERROR(MATCH($A102&\"#\"&N$1,'[1]Pt1-DATA'!$C:$C,0),0)","v":0},{"$f":"IFERROR(MATCH($A102&\"#\"&O$1,'[1]Pt1-DATA'!$C:$C,0),0)","v":0},{"$f":"IFERROR(MATCH($A102&\"#\"&P$1,'[1]Pt1-DATA'!$C:$C,0),0)","v":0},{"$f":"IFERROR(MATCH($A102&\"#\"&Q$1,'[1]Pt1-DATA'!$C:$C,0),0)","v":0},{"$f":"IFERROR(MATCH($A102&\"#\"&R$1,'[1]Pt1-DATA'!$C:$C,0),0)","v":0},{"$f":"IFERROR(MATCH($A102&\"#\"&S$1,'[1]Pt1-DATA'!$C:$C,0),0)","v":0},{"$f":"IFERROR(MATCH($A102&\"#\"&T$1,'[1]Pt1-DATA'!$C:$C,0),0)","v":11604}]
[593,"Freighter","Large Freighters","Boeing 747","Boeing 747-400CF","Pratt & Whitney PW4000-94","wide body (non IMA)",null,true,null,{"$f":"IFERROR(MATCH($A103&\"#\"&K$1,'[1]Pt1-DATA'!$C:$C,0),0)","v":383},null,{"$f":"IFERROR(MATCH($A103&\"#\"&M$1,'[1]Pt1-DATA'!$C:$C,0),0)","v":0},{"$f":"IFERROR(MATCH($A103&\"#\"&N$1,'[1]Pt1-DATA'!$C:$C,0),0)","v":0},{"$f":"IFERROR(MATCH($A103&\"#\"&O$1,'[1]Pt1-DATA'!$C:$C,0),0)","v":0},{"$f":"IFERROR(MATCH($A103&\"#\"&P$1,'[1]Pt1-DATA'!$C:$C,0),0)","v":0},{"$f":"IFERROR(MATCH($A103&\"#\"&Q$1,'[1]Pt1-DATA'!$C:$C,0),0)","v":0},{"$f":"IFERROR(MATCH($A103&\"#\"&R$1,'[1]Pt1-DATA'!$C:$C,0),0)","v":0},{"$f":"IFERROR(MATCH($A103&\"#\"&S$1,'[1]Pt1-DATA'!$C:$C,0),0)","v":0},{"$f":"IFERROR(MATCH($A103&\"#\"&T$1,'[1]Pt1-DATA'!$C:$C,0),0)","v":11605}]
[629,"Freighter","Large Freighters","Boeing 747","Boeing 747-400F/ERF","General Electric CF6-80C2","wide body (non IMA)",null,true,null,{"$f":"IFERROR(MATCH($A104&\"#\"&K$1,'[1]Pt1-DATA'!$C:$C,0),0)","v":384},null,{"$f":"IFERROR(MATCH($A104&\"#\"&M$1,'[1]Pt1-DATA'!$C:$C,0),0)","v":0},{"$f":"IFERROR(MATCH($A104&\"#\"&N$1,'[1]Pt1-DATA'!$C:$C,0),0)","v":0},{"$f":"IFERROR(MATCH($A104&\"#\"&O$1,'[1]Pt1-DATA'!$C:$C,0),0)","v":0},{"$f":"IFERROR(MATCH($A104&\"#\"&P$1,'[1]Pt1-DATA'!$C:$C,0),0)","v":0},{"$f":"IFERROR(MATCH($A104&\"#\"&Q$1,'[1]Pt1-DATA'!$C:$C,0),0)","v":0},{"$f":"IFERROR(MATCH($A104&\"#\"&R$1,'[1]Pt1-DATA'!$C:$C,0),0)","v":0},{"$f":"IFERROR(MATCH($A104&\"#\"&S$1,'[1]Pt1-DATA'!$C:$C,0),0)","v":0},{"$f":"IFERROR(MATCH($A104&\"#\"&T$1,'[1]Pt1-DATA'!$C:$C,0),0)","v":11606}]
[628,"Freighter","Large Freighters","Boeing 747","Boeing 747-400F/ERF","Pratt & Whitney PW4000-94","wide body (non IMA)",null,true,null,{"$f":"IFERROR(MATCH($A105&\"#\"&K$1,'[1]Pt1-DATA'!$C:$C,0),0)","v":385},null,{"$f":"IFERROR(MATCH($A105&\"#\"&M$1,'[1]Pt1-DATA'!$C:$C,0),0)","v":0},{"$f":"IFERROR(MATCH($A105&\"#\"&N$1,'[1]Pt1-DATA'!$C:$C,0),0)","v":0},{"$f":"IFERROR(MATCH($A105&\"#\"&O$1,'[1]Pt1-DATA'!$C:$C,0),0)","v":0},{"$f":"IFERROR(MATCH($A105&\"#\"&P$1,'[1]Pt1-DATA'!$C:$C,0),0)","v":0},{"$f":"IFERROR(MATCH($A105&\"#\"&Q$1,'[1]Pt1-DATA'!$C:$C,0),0)","v":0},{"$f":"IFERROR(MATCH($A105&\"#\"&R$1,'[1]Pt1-DATA'!$C:$C,0),0)","v":0},{"$f":"IFERROR(MATCH($A105&\"#\"&S$1,'[1]Pt1-DATA'!$C:$C,0),0)","v":0},{"$f":"IFERROR(MATCH($A105&\"#\"&T$1,'[1]Pt1-DATA'!$C:$C,0),0)","v":11607}]
[630,"Freighter","Large Freighters","Boeing 747","Boeing 747-400F/ERF","Rolls-Royce RB211-524G/H &T","wide body (non IMA)",null,true,null,{"$f":"IFERROR(MATCH($A106&\"#\"&K$1,'[1]Pt1-DATA'!$C:$C,0),0)","v":386},null,{"$f":"IFERROR(MATCH($A106&\"#\"&M$1,'[1]Pt1-DATA'!$C:$C,0),0)","v":0},{"$f":"IFERROR(MATCH($A106&\"#\"&N$1,'[1]Pt1-DATA'!$C:$C,0),0)","v":0},{"$f":"IFERROR(MATCH($A106&\"#\"&O$1,'[1]Pt1-DATA'!$C:$C,0),0)","v":0},{"$f":"IFERROR(MATCH($A106&\"#\"&P$1,'[1]Pt1-DATA'!$C:$C,0),0)","v":0},{"$f":"IFERROR(MATCH($A106&\"#\"&Q$1,'[1]Pt1-DATA'!$C:$C,0),0)","v":0},{"$f":"IFERROR(MATCH($A106&\"#\"&R$1,'[1]Pt1-DATA'!$C:$C,0),0)","v":0},{"$f":"IFERROR(MATCH($A106&\"#\"&S$1,'[1]Pt1-DATA'!$C:$C,0),0)","v":0},{"$f":"IFERROR(MATCH($A106&\"#\"&T$1,'[1]Pt1-DATA'!$C:$C,0),0)","v":11608}]
[567,"Freighter","Large Freighters","Boeing 747","Boeing 747-8F","General Electric GEnx-2B","wide body (non IMA)",null,true,null,{"$f":"IFERROR(MATCH($A107&\"#\"&K$1,'[1]Pt1-DATA'!$C:$C,0),0)","v":387},null,{"$f":"IFERROR(MATCH($A107&\"#\"&M$1,'[1]Pt1-DATA'!$C:$C,0),0)","v":0},{"$f":"IFERROR(MATCH($A107&\"#\"&N$1,'[1]Pt1-DATA'!$C:$C,0),0)","v":7401},{"$f":"IFERROR(MATCH($A107&\"#\"&O$1,'[1]Pt1-DATA'!$C:$C,0),0)","v":7618},{"$f":"IFERROR(MATCH($A107&\"#\"&P$1,'[1]Pt1-DATA'!$C:$C,0),0)","v":0},{"$f":"IFERROR(MATCH($A107&\"#\"&Q$1,'[1]Pt1-DATA'!$C:$C,0),0)","v":0},{"$f":"IFERROR(MATCH($A107&\"#\"&R$1,'[1]Pt1-DATA'!$C:$C,0),0)","v":0},{"$f":"IFERROR(MATCH($A107&\"#\"&S$1,'[1]Pt1-DATA'!$C:$C,0),0)","v":0},{"$f":"IFERROR(MATCH($A107&\"#\"&T$1,'[1]Pt1-DATA'!$C:$C,0),0)","v":11609}]
[664,"Freighter","Large Freighters","Boeing 777","Boeing 777-300 ERSF","General Electric GE90-115B","wide body (IMA)",null,true,null,{"$f":"IFERROR(MATCH($A108&\"#\"&K$1,'[1]Pt1-DATA'!$C:$C,0),0)","v":388},null,{"$f":"IFERROR(MATCH($A108&\"#\"&M$1,'[1]Pt1-DATA'!$C:$C,0),0)","v":0},{"$f":"IFERROR(MATCH($A108&\"#\"&N$1,'[1]Pt1-DATA'!$C:$C,0),0)","v":7402},{"$f":"IFERROR(MATCH($A108&\"#\"&O$1,'[1]Pt1-DATA'!$C:$C,0),0)","v":7619},{"$f":"IFERROR(MATCH($A108&\"#\"&P$1,'[1]Pt1-DATA'!$C:$C,0),0)","v":0},{"$f":"IFERROR(MATCH($A108&\"#\"&Q$1,'[1]Pt1-DATA'!$C:$C,0),0)","v":0},{"$f":"IFERROR(MATCH($A108&\"#\"&R$1,'[1]Pt1-DATA'!$C:$C,0),0)","v":0},{"$f":"IFERROR(MATCH($A108&\"#\"&S$1,'[1]Pt1-DATA'!$C:$C,0),0)","v":0},{"$f":"IFERROR(MATCH($A108&\"#\"&T$1,'[1]Pt1-DATA'!$C:$C,0),0)","v":11610}]
[568,"Freighter","Large Freighters","Boeing 777","Boeing 777F","General Electric GE90-115B","wide body (IMA)",null,true,null,{"$f":"IFERROR(MATCH($A109&\"#\"&K$1,'[1]Pt1-DATA'!$C:$C,0),0)","v":389},null,{"$f":"IFERROR(MATCH($A109&\"#\"&M$1,'[1]Pt1-DATA'!$C:$C,0),0)","v":0},{"$f":"IFERROR(MATCH($A109&\"#\"&N$1,'[1]Pt1-DATA'!$C:$C,0),0)","v":7403},{"$f":"IFERROR(MATCH($A109&\"#\"&O$1,'[1]Pt1-DATA'!$C:$C,0),0)","v":7620},{"$f":"IFERROR(MATCH($A109&\"#\"&P$1,'[1]Pt1-DATA'!$C:$C,0),0)","v":0},{"$f":"IFERROR(MATCH($A109&\"#\"&Q$1,'[1]Pt1-DATA'!$C:$C,0),0)","v":0},{"$f":"IFERROR(MATCH($A109&\"#\"&R$1,'[1]Pt1-DATA'!$C:$C,0),0)","v":0},{"$f":"IFERROR(MATCH($A109&\"#\"&S$1,'[1]Pt1-DATA'!$C:$C,0),0)","v":0},{"$f":"IFERROR(MATCH($A109&\"#\"&T$1,'[1]Pt1-DATA'!$C:$C,0),0)","v":11611}]
[659,"Freighter","Large Freighters","Boeing 777X","Boeing 777XF: 777-9","General Electric GE9X","wide body (IMA)",null,true,null,{"$f":"IFERROR(MATCH($A110&\"#\"&K$1,'[1]Pt1-DATA'!$C:$C,0),0)","v":390},null,{"$f":"IFERROR(MATCH($A110&\"#\"&M$1,'[1]Pt1-DATA'!$C:$C,0),0)","v":0},{"$f":"IFERROR(MATCH($A110&\"#\"&N$1,'[1]Pt1-DATA'!$C:$C,0),0)","v":0},{"$f":"IFERROR(MATCH($A110&\"#\"&O$1,'[1]Pt1-DATA'!$C:$C,0),0)","v":0},{"$f":"IFERROR(MATCH($A110&\"#\"&P$1,'[1]Pt1-DATA'!$C:$C,0),0)","v":0},{"$f":"IFERROR(MATCH($A110&\"#\"&Q$1,'[1]Pt1-DATA'!$C:$C,0),0)","v":0},{"$f":"IFERROR(MATCH($A110&\"#\"&R$1,'[1]Pt1-DATA'!$C:$C,0),0)","v":0},{"$f":"IFERROR(MATCH($A110&\"#\"&S$1,'[1]Pt1-DATA'!$C:$C,0),0)","v":0},{"$f":"IFERROR(MATCH($A110&\"#\"&T$1,'[1]Pt1-DATA'!$C:$C,0),0)","v":11661}]
[632,"Freighter","Medium Widebody Freighters","A300","A300-600F/RF","General Electric CF6-80C2","wide body (non IMA)",null,true,null,{"$f":"IFERROR(MATCH($A111&\"#\"&K$1,'[1]Pt1-DATA'!$C:$C,0),0)","v":391},null,{"$f":"IFERROR(MATCH($A111&\"#\"&M$1,'[1]Pt1-DATA'!$C:$C,0),0)","v":0},{"$f":"IFERROR(MATCH($A111&\"#\"&N$1,'[1]Pt1-DATA'!$C:$C,0),0)","v":0},{"$f":"IFERROR(MATCH($A111&\"#\"&O$1,'[1]Pt1-DATA'!$C:$C,0),0)","v":0},{"$f":"IFERROR(MATCH($A111&\"#\"&P$1,'[1]Pt1-DATA'!$C:$C,0),0)","v":0},{"$f":"IFERROR(MATCH($A111&\"#\"&Q$1,'[1]Pt1-DATA'!$C:$C,0),0)","v":0},{"$f":"IFERROR(MATCH($A111&\"#\"&R$1,'[1]Pt1-DATA'!$C:$C,0),0)","v":0},{"$f":"IFERROR(MATCH($A111&\"#\"&S$1,'[1]Pt1-DATA'!$C:$C,0),0)","v":0},{"$f":"IFERROR(MATCH($A111&\"#\"&T$1,'[1]Pt1-DATA'!$C:$C,0),0)","v":11612}]
[631,"Freighter","Medium Widebody Freighters","A300","A300-600F/RF","Pratt & Whitney PW4000-94","wide body (non IMA)",null,true,null,{"$f":"IFERROR(MATCH($A112&\"#\"&K$1,'[1]Pt1-DATA'!$C:$C,0),0)","v":392},null,{"$f":"IFERROR(MATCH($A112&\"#\"&M$1,'[1]Pt1-DATA'!$C:$C,0),0)","v":0},{"$f":"IFERROR(MATCH($A112&\"#\"&N$1,'[1]Pt1-DATA'!$C:$C,0),0)","v":0},{"$f":"IFERROR(MATCH($A112&\"#\"&O$1,'[1]Pt1-DATA'!$C:$C,0),0)","v":0},{"$f":"IFERROR(MATCH($A112&\"#\"&P$1,'[1]Pt1-DATA'!$C:$C,0),0)","v":0},{"$f":"IFERROR(MATCH($A112&\"#\"&Q$1,'[1]Pt1-DATA'!$C:$C,0),0)","v":0},{"$f":"IFERROR(MATCH($A112&\"#\"&R$1,'[1]Pt1-DATA'!$C:$C,0),0)","v":0},{"$f":"IFERROR(MATCH($A112&\"#\"&S$1,'[1]Pt1-DATA'!$C:$C,0),0)","v":0},{"$f":"IFERROR(MATCH($A112&\"#\"&T$1,'[1]Pt1-DATA'!$C:$C,0),0)","v":11613}]
[566,"Freighter","Medium Widebody Freighters","A300","Airbus A300-600ST Beluga","General Electric CF6-80A2","wide body (non IMA)",null,true,null,{"$f":"IFERROR(MATCH($A113&\"#\"&K$1,'[1]Pt1-DATA'!$C:$C,0),0)","v":393},null,{"$f":"IFERROR(MATCH($A113&\"#\"&M$1,'[1]Pt1-DATA'!$C:$C,0),0)","v":0},{"$f":"IFERROR(MATCH($A113&\"#\"&N$1,'[1]Pt1-DATA'!$C:$C,0),0)","v":0},{"$f":"IFERROR(MATCH($A113&\"#\"&O$1,'[1]Pt1-DATA'!$C:$C,0),0)","v":0},{"$f":"IFERROR(MATCH($A113&\"#\"&P$1,'[1]Pt1-DATA'!$C:$C,0),0)","v":0},{"$f":"IFERROR(MATCH($A113&\"#\"&Q$1,'[1]Pt1-DATA'!$C:$C,0),0)","v":0},{"$f":"IFERROR(MATCH($A113&\"#\"&R$1,'[1]Pt1-DATA'!$C:$C,0),0)","v":0},{"$f":"IFERROR(MATCH($A113&\"#\"&S$1,'[1]Pt1-DATA'!$C:$C,0),0)","v":0},{"$f":"IFERROR(MATCH($A113&\"#\"&T$1,'[1]Pt1-DATA'!$C:$C,0),0)","v":0}]
[560,"Freighter","Medium Widebody Freighters","A330","Airbus A330-200F","Pratt & Whitney PW4000-100","wide body (non IMA)",null,true,null,{"$f":"IFERROR(MATCH($A114&\"#\"&K$1,'[1]Pt1-DATA'!$C:$C,0),0)","v":370},null,{"$f":"IFERROR(MATCH($A114&\"#\"&M$1,'[1]Pt1-DATA'!$C:$C,0),0)","v":0},{"$f":"IFERROR(MATCH($A114&\"#\"&N$1,'[1]Pt1-DATA'!$C:$C,0),0)","v":0},{"$f":"IFERROR(MATCH($A114&\"#\"&O$1,'[1]Pt1-DATA'!$C:$C,0),0)","v":0},{"$f":"IFERROR(MATCH($A114&\"#\"&P$1,'[1]Pt1-DATA'!$C:$C,0),0)","v":0},{"$f":"IFERROR(MATCH($A114&\"#\"&Q$1,'[1]Pt1-DATA'!$C:$C,0),0)","v":0},{"$f":"IFERROR(MATCH($A114&\"#\"&R$1,'[1]Pt1-DATA'!$C:$C,0),0)","v":0},{"$f":"IFERROR(MATCH($A114&\"#\"&S$1,'[1]Pt1-DATA'!$C:$C,0),0)","v":0},{"$f":"IFERROR(MATCH($A114&\"#\"&T$1,'[1]Pt1-DATA'!$C:$C,0),0)","v":11653}]
[561,"Freighter","Medium Widebody Freighters","A330","Airbus A330-200F","Rolls-Royce Trent 700","wide body (non IMA)",null,true,null,{"$f":"IFERROR(MATCH($A115&\"#\"&K$1,'[1]Pt1-DATA'!$C:$C,0),0)","v":371},null,{"$f":"IFERROR(MATCH($A115&\"#\"&M$1,'[1]Pt1-DATA'!$C:$C,0),0)","v":0},{"$f":"IFERROR(MATCH($A115&\"#\"&N$1,'[1]Pt1-DATA'!$C:$C,0),0)","v":0},{"$f":"IFERROR(MATCH($A115&\"#\"&O$1,'[1]Pt1-DATA'!$C:$C,0),0)","v":0},{"$f":"IFERROR(MATCH($A115&\"#\"&P$1,'[1]Pt1-DATA'!$C:$C,0),0)","v":0},{"$f":"IFERROR(MATCH($A115&\"#\"&Q$1,'[1]Pt1-DATA'!$C:$C,0),0)","v":0},{"$f":"IFERROR(MATCH($A115&\"#\"&R$1,'[1]Pt1-DATA'!$C:$C,0),0)","v":0},{"$f":"IFERROR(MATCH($A115&\"#\"&S$1,'[1]Pt1-DATA'!$C:$C,0),0)","v":0},{"$f":"IFERROR(MATCH($A115&\"#\"&T$1,'[1]Pt1-DATA'!$C:$C,0),0)","v":11654}]
[562,"Freighter","Medium Widebody Freighters","A330","Airbus A330-300P2F","General Electric CF6-80E1","wide body (non IMA)",null,true,null,{"$f":"IFERROR(MATCH($A116&\"#\"&K$1,'[1]Pt1-DATA'!$C:$C,0),0)","v":372},null,{"$f":"IFERROR(MATCH($A116&\"#\"&M$1,'[1]Pt1-DATA'!$C:$C,0),0)","v":0},{"$f":"IFERROR(MATCH($A116&\"#\"&N$1,'[1]Pt1-DATA'!$C:$C,0),0)","v":0},{"$f":"IFERROR(MATCH($A116&\"#\"&O$1,'[1]Pt1-DATA'!$C:$C,0),0)","v":0},{"$f":"IFERROR(MATCH($A116&\"#\"&P$1,'[1]Pt1-DATA'!$C:$C,0),0)","v":0},{"$f":"IFERROR(MATCH($A116&\"#\"&Q$1,'[1]Pt1-DATA'!$C:$C,0),0)","v":0},{"$f":"IFERROR(MATCH($A116&\"#\"&R$1,'[1]Pt1-DATA'!$C:$C,0),0)","v":0},{"$f":"IFERROR(MATCH($A116&\"#\"&S$1,'[1]Pt1-DATA'!$C:$C,0),0)","v":0},{"$f":"IFERROR(MATCH($A116&\"#\"&T$1,'[1]Pt1-DATA'!$C:$C,0),0)","v":11655}]
[563,"Freighter","Medium Widebody Freighters","A330","Airbus A330-300P2F","Pratt & Whitney PW4000-100","wide body (non IMA)",null,true,null,{"$f":"IFERROR(MATCH($A117&\"#\"&K$1,'[1]Pt1-DATA'!$C:$C,0),0)","v":373},null,{"$f":"IFERROR(MATCH($A117&\"#\"&M$1,'[1]Pt1-DATA'!$C:$C,0),0)","v":0},{"$f":"IFERROR(MATCH($A117&\"#\"&N$1,'[1]Pt1-DATA'!$C:$C,0),0)","v":0},{"$f":"IFERROR(MATCH($A117&\"#\"&O$1,'[1]Pt1-DATA'!$C:$C,0),0)","v":0},{"$f":"IFERROR(MATCH($A117&\"#\"&P$1,'[1]Pt1-DATA'!$C:$C,0),0)","v":0},{"$f":"IFERROR(MATCH($A117&\"#\"&Q$1,'[1]Pt1-DATA'!$C:$C,0),0)","v":0},{"$f":"IFERROR(MATCH($A117&\"#\"&R$1,'[1]Pt1-DATA'!$C:$C,0),0)","v":0},{"$f":"IFERROR(MATCH($A117&\"#\"&S$1,'[1]Pt1-DATA'!$C:$C,0),0)","v":0},{"$f":"IFERROR(MATCH($A117&\"#\"&T$1,'[1]Pt1-DATA'!$C:$C,0),0)","v":11656}]
[564,"Freighter","Medium Widebody Freighters","A330","Airbus A330-300P2F","Rolls-Royce Trent 700","wide body (non IMA)",null,true,null,{"$f":"IFERROR(MATCH($A118&\"#\"&K$1,'[1]Pt1-DATA'!$C:$C,0),0)","v":374},null,{"$f":"IFERROR(MATCH($A118&\"#\"&M$1,'[1]Pt1-DATA'!$C:$C,0),0)","v":0},{"$f":"IFERROR(MATCH($A118&\"#\"&N$1,'[1]Pt1-DATA'!$C:$C,0),0)","v":0},{"$f":"IFERROR(MATCH($A118&\"#\"&O$1,'[1]Pt1-DATA'!$C:$C,0),0)","v":0},{"$f":"IFERROR(MATCH($A118&\"#\"&P$1,'[1]Pt1-DATA'!$C:$C,0),0)","v":0},{"$f":"IFERROR(MATCH($A118&\"#\"&Q$1,'[1]Pt1-DATA'!$C:$C,0),0)","v":0},{"$f":"IFERROR(MATCH($A118&\"#\"&R$1,'[1]Pt1-DATA'!$C:$C,0),0)","v":0},{"$f":"IFERROR(MATCH($A118&\"#\"&S$1,'[1]Pt1-DATA'!$C:$C,0),0)","v":0},{"$f":"IFERROR(MATCH($A118&\"#\"&T$1,'[1]Pt1-DATA'!$C:$C,0),0)","v":11657}]
[669,"Freighter","Medium Widebody Freighters","A340","Airbus A340-600NGF","CFM International CFM56 - CFM56-5C","wide body (non IMA)",null,true,null,{"$f":"IFERROR(MATCH($A119&\"#\"&K$1,'[1]Pt1-DATA'!$C:$C,0),0)","v":375},null,{"$f":"IFERROR(MATCH($A119&\"#\"&M$1,'[1]Pt1-DATA'!$C:$C,0),0)","v":0},{"$f":"IFERROR(MATCH($A119&\"#\"&N$1,'[1]Pt1-DATA'!$C:$C,0),0)","v":0},{"$f":"IFERROR(MATCH($A119&\"#\"&O$1,'[1]Pt1-DATA'!$C:$C,0),0)","v":0},{"$f":"IFERROR(MATCH($A119&\"#\"&P$1,'[1]Pt1-DATA'!$C:$C,0),0)","v":0},{"$f":"IFERROR(MATCH($A119&\"#\"&Q$1,'[1]Pt1-DATA'!$C:$C,0),0)","v":0},{"$f":"IFERROR(MATCH($A119&\"#\"&R$1,'[1]Pt1-DATA'!$C:$C,0),0)","v":0},{"$f":"IFERROR(MATCH($A119&\"#\"&S$1,'[1]Pt1-DATA'!$C:$C,0),0)","v":0},{"$f":"IFERROR(MATCH($A119&\"#\"&T$1,'[1]Pt1-DATA'!$C:$C,0),0)","v":11658}]
[570,"Freighter","Medium Widebody Freighters","Boeing 767","Boeing 767-300BCF","General Electric CF6-80C2","wide body (non IMA)",null,true,null,{"$f":"IFERROR(MATCH($A120&\"#\"&K$1,'[1]Pt1-DATA'!$C:$C,0),0)","v":376},null,{"$f":"IFERROR(MATCH($A120&\"#\"&M$1,'[1]Pt1-DATA'!$C:$C,0),0)","v":0},{"$f":"IFERROR(MATCH($A120&\"#\"&N$1,'[1]Pt1-DATA'!$C:$C,0),0)","v":0},{"$f":"IFERROR(MATCH($A120&\"#\"&O$1,'[1]Pt1-DATA'!$C:$C,0),0)","v":0},{"$f":"IFERROR(MATCH($A120&\"#\"&P$1,'[1]Pt1-DATA'!$C:$C,0),0)","v":0},{"$f":"IFERROR(MATCH($A120&\"#\"&Q$1,'[1]Pt1-DATA'!$C:$C,0),0)","v":0},{"$f":"IFERROR(MATCH($A120&\"#\"&R$1,'[1]Pt1-DATA'!$C:$C,0),0)","v":0},{"$f":"IFERROR(MATCH($A120&\"#\"&S$1,'[1]Pt1-DATA'!$C:$C,0),0)","v":0},{"$f":"IFERROR(MATCH($A120&\"#\"&T$1,'[1]Pt1-DATA'!$C:$C,0),0)","v":11600}]
[569,"Freighter","Medium Widebody Freighters","Boeing 767","Boeing 767-300F","General Electric CF6-80C2","wide body (non IMA)",null,true,null,{"$f":"IFERROR(MATCH($A121&\"#\"&K$1,'[1]Pt1-DATA'!$C:$C,0),0)","v":377},null,{"$f":"IFERROR(MATCH($A121&\"#\"&M$1,'[1]Pt1-DATA'!$C:$C,0),0)","v":0},{"$f":"IFERROR(MATCH($A121&\"#\"&N$1,'[1]Pt1-DATA'!$C:$C,0),0)","v":0},{"$f":"IFERROR(MATCH($A121&\"#\"&O$1,'[1]Pt1-DATA'!$C:$C,0),0)","v":0},{"$f":"IFERROR(MATCH($A121&\"#\"&P$1,'[1]Pt1-DATA'!$C:$C,0),0)","v":0},{"$f":"IFERROR(MATCH($A121&\"#\"&Q$1,'[1]Pt1-DATA'!$C:$C,0),0)","v":0},{"$f":"IFERROR(MATCH($A121&\"#\"&R$1,'[1]Pt1-DATA'!$C:$C,0),0)","v":0},{"$f":"IFERROR(MATCH($A121&\"#\"&S$1,'[1]Pt1-DATA'!$C:$C,0),0)","v":0},{"$f":"IFERROR(MATCH($A121&\"#\"&T$1,'[1]Pt1-DATA'!$C:$C,0),0)","v":11601}]
[627,"Freighter","Medium Widebody Freighters","McDonnell Douglas MD-11","McDonnell Douglas MD-11F/CF","General Electric CF6-80C2","wide body (non IMA)",null,true,null,{"$f":"IFERROR(MATCH($A122&\"#\"&K$1,'[1]Pt1-DATA'!$C:$C,0),0)","v":378},null,{"$f":"IFERROR(MATCH($A122&\"#\"&M$1,'[1]Pt1-DATA'!$C:$C,0),0)","v":0},{"$f":"IFERROR(MATCH($A122&\"#\"&N$1,'[1]Pt1-DATA'!$C:$C,0),0)","v":0},{"$f":"IFERROR(MATCH($A122&\"#\"&O$1,'[1]Pt1-DATA'!$C:$C,0),0)","v":0},{"$f":"IFERROR(MATCH($A122&\"#\"&P$1,'[1]Pt1-DATA'!$C:$C,0),0)","v":0},{"$f":"IFERROR(MATCH($A122&\"#\"&Q$1,'[1]Pt1-DATA'!$C:$C,0),0)","v":0},{"$f":"IFERROR(MATCH($A122&\"#\"&R$1,'[1]Pt1-DATA'!$C:$C,0),0)","v":0},{"$f":"IFERROR(MATCH($A122&\"#\"&S$1,'[1]Pt1-DATA'!$C:$C,0),0)","v":0},{"$f":"IFERROR(MATCH($A122&\"#\"&T$1,'[1]Pt1-DATA'!$C:$C,0),0)","v":11602}]
[626,"Freighter","Medium Widebody Freighters","McDonnell Douglas MD-11","McDonnell Douglas MD-11F/CF","Pratt & Whitney PW4000-94","wide body (non IMA)",null,true,null,{"$f":"IFERROR(MATCH($A123&\"#\"&K$1,'[1]Pt1-DATA'!$C:$C,0),0)","v":379},null,{"$f":"IFERROR(MATCH($A123&\"#\"&M$1,'[1]Pt1-DATA'!$C:$C,0),0)","v":0},{"$f":"IFERROR(MATCH($A123&\"#\"&N$1,'[1]Pt1-DATA'!$C:$C,0),0)","v":0},{"$f":"IFERROR(MATCH($A123&\"#\"&O$1,'[1]Pt1-DATA'!$C:$C,0),0)","v":0},{"$f":"IFERROR(MATCH($A123&\"#\"&P$1,'[1]Pt1-DATA'!$C:$C,0),0)","v":0},{"$f":"IFERROR(MATCH($A123&\"#\"&Q$1,'[1]Pt1-DATA'!$C:$C,0),0)","v":0},{"$f":"IFERROR(MATCH($A123&\"#\"&R$1,'[1]Pt1-DATA'!$C:$C,0),0)","v":0},{"$f":"IFERROR(MATCH($A123&\"#\"&S$1,'[1]Pt1-DATA'!$C:$C,0),0)","v":0},{"$f":"IFERROR(MATCH($A123&\"#\"&T$1,'[1]Pt1-DATA'!$C:$C,0),0)","v":11603}]
[665,"Freighter","Standard body Freighters","A320ceo","A320-200P2F","CFM International CFM56 - CFM56-5A","Narrow Body",null,true,null,{"$f":"IFERROR(MATCH($A124&\"#\"&K$1,'[1]Pt1-DATA'!$C:$C,0),0)","v":282},null,{"$f":"IFERROR(MATCH($A124&\"#\"&M$1,'[1]Pt1-DATA'!$C:$C,0),0)","v":0},{"$f":"IFERROR(MATCH($A124&\"#\"&N$1,'[1]Pt1-DATA'!$C:$C,0),0)","v":0},{"$f":"IFERROR(MATCH($A124&\"#\"&O$1,'[1]Pt1-DATA'!$C:$C,0),0)","v":0},{"$f":"IFERROR(MATCH($A124&\"#\"&P$1,'[1]Pt1-DATA'!$C:$C,0),0)","v":0},{"$f":"IFERROR(MATCH($A124&\"#\"&Q$1,'[1]Pt1-DATA'!$C:$C,0),0)","v":0},{"$f":"IFERROR(MATCH($A124&\"#\"&R$1,'[1]Pt1-DATA'!$C:$C,0),0)","v":0},{"$f":"IFERROR(MATCH($A124&\"#\"&S$1,'[1]Pt1-DATA'!$C:$C,0),0)","v":0},{"$f":"IFERROR(MATCH($A124&\"#\"&T$1,'[1]Pt1-DATA'!$C:$C,0),0)","v":0}]
[666,"Freighter","Standard body Freighters","A320ceo","A321P2F","IAE V2500-A5","Narrow Body",null,true,null,{"$f":"IFERROR(MATCH($A125&\"#\"&K$1,'[1]Pt1-DATA'!$C:$C,0),0)","v":283},null,{"$f":"IFERROR(MATCH($A125&\"#\"&M$1,'[1]Pt1-DATA'!$C:$C,0),0)","v":0},{"$f":"IFERROR(MATCH($A125&\"#\"&N$1,'[1]Pt1-DATA'!$C:$C,0),0)","v":0},{"$f":"IFERROR(MATCH($A125&\"#\"&O$1,'[1]Pt1-DATA'!$C:$C,0),0)","v":0},{"$f":"IFERROR(MATCH($A125&\"#\"&P$1,'[1]Pt1-DATA'!$C:$C,0),0)","v":0},{"$f":"IFERROR(MATCH($A125&\"#\"&Q$1,'[1]Pt1-DATA'!$C:$C,0),0)","v":0},{"$f":"IFERROR(MATCH($A125&\"#\"&R$1,'[1]Pt1-DATA'!$C:$C,0),0)","v":0},{"$f":"IFERROR(MATCH($A125&\"#\"&S$1,'[1]Pt1-DATA'!$C:$C,0),0)","v":0},{"$f":"IFERROR(MATCH($A125&\"#\"&T$1,'[1]Pt1-DATA'!$C:$C,0),0)","v":0}]
[573,"Freighter","Standard body Freighters","Boeing 737","Boeing 737-300SF","CFM International CFM56 - 3 ","Narrow Body",null,true,null,{"$f":"IFERROR(MATCH($A126&\"#\"&K$1,'[1]Pt1-DATA'!$C:$C,0),0)","v":284},null,{"$f":"IFERROR(MATCH($A126&\"#\"&M$1,'[1]Pt1-DATA'!$C:$C,0),0)","v":0},{"$f":"IFERROR(MATCH($A126&\"#\"&N$1,'[1]Pt1-DATA'!$C:$C,0),0)","v":0},{"$f":"IFERROR(MATCH($A126&\"#\"&O$1,'[1]Pt1-DATA'!$C:$C,0),0)","v":0},{"$f":"IFERROR(MATCH($A126&\"#\"&P$1,'[1]Pt1-DATA'!$C:$C,0),0)","v":0},{"$f":"IFERROR(MATCH($A126&\"#\"&Q$1,'[1]Pt1-DATA'!$C:$C,0),0)","v":0},{"$f":"IFERROR(MATCH($A126&\"#\"&R$1,'[1]Pt1-DATA'!$C:$C,0),0)","v":0},{"$f":"IFERROR(MATCH($A126&\"#\"&S$1,'[1]Pt1-DATA'!$C:$C,0),0)","v":0},{"$f":"IFERROR(MATCH($A126&\"#\"&T$1,'[1]Pt1-DATA'!$C:$C,0),0)","v":0}]
[572,"Freighter","Standard body Freighters","Boeing 737","Boeing 737-400SF","CFM International CFM56 - 3 ","Narrow Body",null,true,null,{"$f":"IFERROR(MATCH($A127&\"#\"&K$1,'[1]Pt1-DATA'!$C:$C,0),0)","v":285},null,{"$f":"IFERROR(MATCH($A127&\"#\"&M$1,'[1]Pt1-DATA'!$C:$C,0),0)","v":0},{"$f":"IFERROR(MATCH($A127&\"#\"&N$1,'[1]Pt1-DATA'!$C:$C,0),0)","v":0},{"$f":"IFERROR(MATCH($A127&\"#\"&O$1,'[1]Pt1-DATA'!$C:$C,0),0)","v":0},{"$f":"IFERROR(MATCH($A127&\"#\"&P$1,'[1]Pt1-DATA'!$C:$C,0),0)","v":0},{"$f":"IFERROR(MATCH($A127&\"#\"&Q$1,'[1]Pt1-DATA'!$C:$C,0),0)","v":0},{"$f":"IFERROR(MATCH($A127&\"#\"&R$1,'[1]Pt1-DATA'!$C:$C,0),0)","v":0},{"$f":"IFERROR(MATCH($A127&\"#\"&S$1,'[1]Pt1-DATA'!$C:$C,0),0)","v":0},{"$f":"IFERROR(MATCH($A127&\"#\"&T$1,'[1]Pt1-DATA'!$C:$C,0),0)","v":0}]
[591,"Freighter","Standard body Freighters","Boeing 737","Boeing 737-700C","CFM International CFM56 - 7B","Narrow Body",null,true,null,{"$f":"IFERROR(MATCH($A128&\"#\"&K$1,'[1]Pt1-DATA'!$C:$C,0),0)","v":286},null,{"$f":"IFERROR(MATCH($A128&\"#\"&M$1,'[1]Pt1-DATA'!$C:$C,0),0)","v":0},{"$f":"IFERROR(MATCH($A128&\"#\"&N$1,'[1]Pt1-DATA'!$C:$C,0),0)","v":0},{"$f":"IFERROR(MATCH($A128&\"#\"&O$1,'[1]Pt1-DATA'!$C:$C,0),0)","v":0},{"$f":"IFERROR(MATCH($A128&\"#\"&P$1,'[1]Pt1-DATA'!$C:$C,0),0)","v":0},{"$f":"IFERROR(MATCH($A128&\"#\"&Q$1,'[1]Pt1-DATA'!$C:$C,0),0)","v":0},{"$f":"IFERROR(MATCH($A128&\"#\"&R$1,'[1]Pt1-DATA'!$C:$C,0),0)","v":0},{"$f":"IFERROR(MATCH($A128&\"#\"&S$1,'[1]Pt1-DATA'!$C:$C,0),0)","v":0},{"$f":"IFERROR(MATCH($A128&\"#\"&T$1,'[1]Pt1-DATA'!$C:$C,0),0)","v":0}]
[571,"Freighter","Standard body Freighters","Boeing 737NG","Boeing 737-700/-800CF","CFM International CFM56 - 7B","Narrow Body",null,true,null,{"$f":"IFERROR(MATCH($A129&\"#\"&K$1,'[1]Pt1-DATA'!$C:$C,0),0)","v":287},null,{"$f":"IFERROR(MATCH($A129&\"#\"&M$1,'[1]Pt1-DATA'!$C:$C,0),0)","v":0},{"$f":"IFERROR(MATCH($A129&\"#\"&N$1,'[1]Pt1-DATA'!$C:$C,0),0)","v":0},{"$f":"IFERROR(MATCH($A129&\"#\"&O$1,'[1]Pt1-DATA'!$C:$C,0),0)","v":0},{"$f":"IFERROR(MATCH($A129&\"#\"&P$1,'[1]Pt1-DATA'!$C:$C,0),0)","v":0},{"$f":"IFERROR(MATCH($A129&\"#\"&Q$1,'[1]Pt1-DATA'!$C:$C,0),0)","v":0},{"$f":"IFERROR(MATCH($A129&\"#\"&R$1,'[1]Pt1-DATA'!$C:$C,0),0)","v":0},{"$f":"IFERROR(MATCH($A129&\"#\"&S$1,'[1]Pt1-DATA'!$C:$C,0),0)","v":0},{"$f":"IFERROR(MATCH($A129&\"#\"&T$1,'[1]Pt1-DATA'!$C:$C,0),0)","v":0}]
[596,"Freighter","Standard body Freighters","Boeing 757","Boeing 757-200 PF/SF","Pratt & Whitney PW2000","Narrow Body",null,true,null,{"$f":"IFERROR(MATCH($A130&\"#\"&K$1,'[1]Pt1-DATA'!$C:$C,0),0)","v":288},null,{"$f":"IFERROR(MATCH($A130&\"#\"&M$1,'[1]Pt1-DATA'!$C:$C,0),0)","v":0},{"$f":"IFERROR(MATCH($A130&\"#\"&N$1,'[1]Pt1-DATA'!$C:$C,0),0)","v":0},{"$f":"IFERROR(MATCH($A130&\"#\"&O$1,'[1]Pt1-DATA'!$C:$C,0),0)","v":0},{"$f":"IFERROR(MATCH($A130&\"#\"&P$1,'[1]Pt1-DATA'!$C:$C,0),0)","v":0},{"$f":"IFERROR(MATCH($A130&\"#\"&Q$1,'[1]Pt1-DATA'!$C:$C,0),0)","v":0},{"$f":"IFERROR(MATCH($A130&\"#\"&R$1,'[1]Pt1-DATA'!$C:$C,0),0)","v":0},{"$f":"IFERROR(MATCH($A130&\"#\"&S$1,'[1]Pt1-DATA'!$C:$C,0),0)","v":0},{"$f":"IFERROR(MATCH($A130&\"#\"&T$1,'[1]Pt1-DATA'!$C:$C,0),0)","v":0}]
[595,"Freighter","Standard body Freighters","Boeing 757","Boeing 757-200 PF/SF","Rolls-Royce RB211-534E4/E4B","Narrow Body",null,{"$f":"SUM(K131:T131)>0","v":true},null,{"$f":"IFERROR(MATCH($A131&\"#\"&K$1,'[1]Pt1-DATA'!$C:$C,0),0)","v":289},null,{"$f":"IFERROR(MATCH($A131&\"#\"&M$1,'[1]Pt1-DATA'!$C:$C,0),0)","v":0},{"$f":"IFERROR(MATCH($A131&\"#\"&N$1,'[1]Pt1-DATA'!$C:$C,0),0)","v":0},{"$f":"IFERROR(MATCH($A131&\"#\"&O$1,'[1]Pt1-DATA'!$C:$C,0),0)","v":0},{"$f":"IFERROR(MATCH($A131&\"#\"&P$1,'[1]Pt1-DATA'!$C:$C,0),0)","v":0},{"$f":"IFERROR(MATCH($A131&\"#\"&Q$1,'[1]Pt1-DATA'!$C:$C,0),0)","v":0},{"$f":"IFERROR(MATCH($A131&\"#\"&R$1,'[1]Pt1-DATA'!$C:$C,0),0)","v":0},{"$f":"IFERROR(MATCH($A131&\"#\"&S$1,'[1]Pt1-DATA'!$C:$C,0),0)","v":0},{"$f":"IFERROR(MATCH($A131&\"#\"&T$1,'[1]Pt1-DATA'!$C:$C,0),0)","v":0}]
[671,"Freighter","Standard body Freighters","Embraer E170/190","Embraer E190F (P2F)","General Electric CF34-10E","Narrow Body",null,true,null,{"$f":"IFERROR(MATCH($A132&\"#\"&K$1,'[1]Pt1-DATA'!$C:$C,0),0)","v":257},null,{"$f":"IFERROR(MATCH($A132&\"#\"&M$1,'[1]Pt1-DATA'!$C:$C,0),0)","v":0},{"$f":"IFERROR(MATCH($A132&\"#\"&N$1,'[1]Pt1-DATA'!$C:$C,0),0)","v":0},{"$f":"IFERROR(MATCH($A132&\"#\"&O$1,'[1]Pt1-DATA'!$C:$C,0),0)","v":0},{"$f":"IFERROR(MATCH($A132&\"#\"&P$1,'[1]Pt1-DATA'!$C:$C,0),0)","v":0},{"$f":"IFERROR(MATCH($A132&\"#\"&Q$1,'[1]Pt1-DATA'!$C:$C,0),0)","v":0},{"$f":"IFERROR(MATCH($A132&\"#\"&R$1,'[1]Pt1-DATA'!$C:$C,0),0)","v":0},{"$f":"IFERROR(MATCH($A132&\"#\"&S$1,'[1]Pt1-DATA'!$C:$C,0),0)","v":0},{"$f":"IFERROR(MATCH($A132&\"#\"&T$1,'[1]Pt1-DATA'!$C:$C,0),0)","v":0}]
[672,"Freighter","Standard body Freighters","Embraer E170/190","Embraer E195F (P2F)","General Electric CF34-10E","Narrow Body",null,true,null,{"$f":"IFERROR(MATCH($A133&\"#\"&K$1,'[1]Pt1-DATA'!$C:$C,0),0)","v":258},null,{"$f":"IFERROR(MATCH($A133&\"#\"&M$1,'[1]Pt1-DATA'!$C:$C,0),0)","v":0},{"$f":"IFERROR(MATCH($A133&\"#\"&N$1,'[1]Pt1-DATA'!$C:$C,0),0)","v":0},{"$f":"IFERROR(MATCH($A133&\"#\"&O$1,'[1]Pt1-DATA'!$C:$C,0),0)","v":0},{"$f":"IFERROR(MATCH($A133&\"#\"&P$1,'[1]Pt1-DATA'!$C:$C,0),0)","v":0},{"$f":"IFERROR(MATCH($A133&\"#\"&Q$1,'[1]Pt1-DATA'!$C:$C,0),0)","v":0},{"$f":"IFERROR(MATCH($A133&\"#\"&R$1,'[1]Pt1-DATA'!$C:$C,0),0)","v":0},{"$f":"IFERROR(MATCH($A133&\"#\"&S$1,'[1]Pt1-DATA'!$C:$C,0),0)","v":0},{"$f":"IFERROR(MATCH($A133&\"#\"&T$1,'[1]Pt1-DATA'!$C:$C,0),0)","v":0}]
[668,"Freighter","Turboprop Freighters","ATR 42/72","ATR 72-600F","Pratt & Whitney Canada PW120","Regional",null,true,null,{"$f":"IFERROR(MATCH($A134&\"#\"&K$1,'[1]Pt1-DATA'!$C:$C,0),0)","v":237},null,{"$f":"IFERROR(MATCH($A134&\"#\"&M$1,'[1]Pt1-DATA'!$C:$C,0),0)","v":0},{"$f":"IFERROR(MATCH($A134&\"#\"&N$1,'[1]Pt1-DATA'!$C:$C,0),0)","v":0},{"$f":"IFERROR(MATCH($A134&\"#\"&O$1,'[1]Pt1-DATA'!$C:$C,0),0)","v":0},{"$f":"IFERROR(MATCH($A134&\"#\"&P$1,'[1]Pt1-DATA'!$C:$C,0),0)","v":0},{"$f":"IFERROR(MATCH($A134&\"#\"&Q$1,'[1]Pt1-DATA'!$C:$C,0),0)","v":0},{"$f":"IFERROR(MATCH($A134&\"#\"&R$1,'[1]Pt1-DATA'!$C:$C,0),0)","v":0},{"$f":"IFERROR(MATCH($A134&\"#\"&S$1,'[1]Pt1-DATA'!$C:$C,0),0)","v":0},{"$f":"IFERROR(MATCH($A134&\"#\"&T$1,'[1]Pt1-DATA'!$C:$C,0),0)","v":0}]
[667,"Freighter","Turboprop Freighters","ATR 42/72","ATR 72/42 Freighter Conversion","Pratt & Whitney Canada PW120","Regional","wide body (IMA)",true,null,{"$f":"IFERROR(MATCH($A135&\"#\"&K$1,'[1]Pt1-DATA'!$C:$C,0),0)","v":238},null,{"$f":"IFERROR(MATCH($A135&\"#\"&M$1,'[1]Pt1-DATA'!$C:$C,0),0)","v":0},{"$f":"IFERROR(MATCH($A135&\"#\"&N$1,'[1]Pt1-DATA'!$C:$C,0),0)","v":0},{"$f":"IFERROR(MATCH($A135&\"#\"&O$1,'[1]Pt1-DATA'!$C:$C,0),0)","v":0},{"$f":"IFERROR(MATCH($A135&\"#\"&P$1,'[1]Pt1-DATA'!$C:$C,0),0)","v":0},{"$f":"IFERROR(MATCH($A135&\"#\"&Q$1,'[1]Pt1-DATA'!$C:$C,0),0)","v":0},{"$f":"IFERROR(MATCH($A135&\"#\"&R$1,'[1]Pt1-DATA'!$C:$C,0),0)","v":0},{"$f":"IFERROR(MATCH($A135&\"#\"&S$1,'[1]Pt1-DATA'!$C:$C,0),0)","v":0},{"$f":"IFERROR(MATCH($A135&\"#\"&T$1,'[1]Pt1-DATA'!$C:$C,0),0)","v":0}]
[92,"Helicopter","Attack","AH-1","Bell AH-1Z Viper","General Electric T700","rotorcraft mil",null,false,null,{"$f":"IFERROR(MATCH($A136&\"#\"&K$1,'[1]Pt1-DATA'!$C:$C,0),0)","v":0},null,{"$f":"IFERROR(MATCH($A136&\"#\"&M$1,'[1]Pt1-DATA'!$C:$C,0),0)","v":0},{"$f":"IFERROR(MATCH($A136&\"#\"&N$1,'[1]Pt1-DATA'!$C:$C,0),0)","v":0},{"$f":"IFERROR(MATCH($A136&\"#\"&O$1,'[1]Pt1-DATA'!$C:$C,0),0)","v":0},{"$f":"IFERROR(MATCH($A136&\"#\"&P$1,'[1]Pt1-DATA'!$C:$C,0),0)","v":0},{"$f":"IFERROR(MATCH($A136&\"#\"&Q$1,'[1]Pt1-DATA'!$C:$C,0),0)","v":0},{"$f":"IFERROR(MATCH($A136&\"#\"&R$1,'[1]Pt1-DATA'!$C:$C,0),0)","v":0},{"$f":"IFERROR(MATCH($A136&\"#\"&S$1,'[1]Pt1-DATA'!$C:$C,0),0)","v":0},{"$f":"IFERROR(MATCH($A136&\"#\"&T$1,'[1]Pt1-DATA'!$C:$C,0),0)","v":0}]
[98,"Helicopter","Attack","AH-64","Boeing AH-64 Apache","General Electric T700","rotorcraft mil",null,true,null,{"$f":"IFERROR(MATCH($A137&\"#\"&K$1,'[1]Pt1-DATA'!$C:$C,0),0)","v":0},null,{"$f":"IFERROR(MATCH($A137&\"#\"&M$1,'[1]Pt1-DATA'!$C:$C,0),0)","v":0},{"$f":"IFERROR(MATCH($A137&\"#\"&N$1,'[1]Pt1-DATA'!$C:$C,0),0)","v":0},{"$f":"IFERROR(MATCH($A137&\"#\"&O$1,'[1]Pt1-DATA'!$C:$C,0),0)","v":0},{"$f":"IFERROR(MATCH($A137&\"#\"&P$1,'[1]Pt1-DATA'!$C:$C,0),0)","v":0},{"$f":"IFERROR(MATCH($A137&\"#\"&Q$1,'[1]Pt1-DATA'!$C:$C,0),0)","v":0},{"$f":"IFERROR(MATCH($A137&\"#\"&R$1,'[1]Pt1-DATA'!$C:$C,0),0)","v":0},{"$f":"IFERROR(MATCH($A137&\"#\"&S$1,'[1]Pt1-DATA'!$C:$C,0),0)","v":9557},{"$f":"IFERROR(MATCH($A137&\"#\"&T$1,'[1]Pt1-DATA'!$C:$C,0),0)","v":0}]
[99,"Helicopter","Attack","AH-64","Boeing AH-64 Apache (reman)","General Electric T700","rotorcraft mil",null,true,null,{"$f":"IFERROR(MATCH($A138&\"#\"&K$1,'[1]Pt1-DATA'!$C:$C,0),0)","v":0},null,{"$f":"IFERROR(MATCH($A138&\"#\"&M$1,'[1]Pt1-DATA'!$C:$C,0),0)","v":0},{"$f":"IFERROR(MATCH($A138&\"#\"&N$1,'[1]Pt1-DATA'!$C:$C,0),0)","v":0},{"$f":"IFERROR(MATCH($A138&\"#\"&O$1,'[1]Pt1-DATA'!$C:$C,0),0)","v":0},{"$f":"IFERROR(MATCH($A138&\"#\"&P$1,'[1]Pt1-DATA'!$C:$C,0),0)","v":0},{"$f":"IFERROR(MATCH($A138&\"#\"&Q$1,'[1]Pt1-DATA'!$C:$C,0),0)","v":0},{"$f":"IFERROR(MATCH($A138&\"#\"&R$1,'[1]Pt1-DATA'!$C:$C,0),0)","v":0},{"$f":"IFERROR(MATCH($A138&\"#\"&S$1,'[1]Pt1-DATA'!$C:$C,0),0)","v":9552},{"$f":"IFERROR(MATCH($A138&\"#\"&T$1,'[1]Pt1-DATA'!$C:$C,0),0)","v":0}]
[648,"Helicopter","Attack","AW 249","Leonardo AW 249","General Electric T700 - CT7 turboprop","rotorcraft mil",null,true,null,{"$f":"IFERROR(MATCH($A139&\"#\"&K$1,'[1]Pt1-DATA'!$C:$C,0),0)","v":0},null,{"$f":"IFERROR(MATCH($A139&\"#\"&M$1,'[1]Pt1-DATA'!$C:$C,0),0)","v":0},{"$f":"IFERROR(MATCH($A139&\"#\"&N$1,'[1]Pt1-DATA'!$C:$C,0),0)","v":0},{"$f":"IFERROR(MATCH($A139&\"#\"&O$1,'[1]Pt1-DATA'!$C:$C,0),0)","v":0},{"$f":"IFERROR(MATCH($A139&\"#\"&P$1,'[1]Pt1-DATA'!$C:$C,0),0)","v":0},{"$f":"IFERROR(MATCH($A139&\"#\"&Q$1,'[1]Pt1-DATA'!$C:$C,0),0)","v":0},{"$f":"IFERROR(MATCH($A139&\"#\"&R$1,'[1]Pt1-DATA'!$C:$C,0),0)","v":0},{"$f":"IFERROR(MATCH($A139&\"#\"&S$1,'[1]Pt1-DATA'!$C:$C,0),0)","v":9553},{"$f":"IFERROR(MATCH($A139&\"#\"&T$1,'[1]Pt1-DATA'!$C:$C,0),0)","v":0}]
[132,"Helicopter","Attack","Future Attack Reconnaissance Aircraft","Bell V-280 Valor ","Rolls-Royce 1107","rotorcraft mil",null,false,null,{"$f":"IFERROR(MATCH($A140&\"#\"&K$1,'[1]Pt1-DATA'!$C:$C,0),0)","v":0},null,{"$f":"IFERROR(MATCH($A140&\"#\"&M$1,'[1]Pt1-DATA'!$C:$C,0),0)","v":0},{"$f":"IFERROR(MATCH($A140&\"#\"&N$1,'[1]Pt1-DATA'!$C:$C,0),0)","v":0},{"$f":"IFERROR(MATCH($A140&\"#\"&O$1,'[1]Pt1-DATA'!$C:$C,0),0)","v":0},{"$f":"IFERROR(MATCH($A140&\"#\"&P$1,'[1]Pt1-DATA'!$C:$C,0),0)","v":0},{"$f":"IFERROR(MATCH($A140&\"#\"&Q$1,'[1]Pt1-DATA'!$C:$C,0),0)","v":0},{"$f":"IFERROR(MATCH($A140&\"#\"&R$1,'[1]Pt1-DATA'!$C:$C,0),0)","v":0},{"$f":"IFERROR(MATCH($A140&\"#\"&S$1,'[1]Pt1-DATA'!$C:$C,0),0)","v":0},{"$f":"IFERROR(MATCH($A140&\"#\"&T$1,'[1]Pt1-DATA'!$C:$C,0),0)","v":0}]
[85,"Helicopter","Attack","TAI/Leonardo T129","TAI/Leonardo T129","LHTEC T800","rotorcraft mil",null,false,null,{"$f":"IFERROR(MATCH($A141&\"#\"&K$1,'[1]Pt1-DATA'!$C:$C,0),0)","v":0},null,{"$f":"IFERROR(MATCH($A141&\"#\"&M$1,'[1]Pt1-DATA'!$C:$C,0),0)","v":0},{"$f":"IFERROR(MATCH($A141&\"#\"&N$1,'[1]Pt1-DATA'!$C:$C,0),0)","v":0},{"$f":"IFERROR(MATCH($A141&\"#\"&O$1,'[1]Pt1-DATA'!$C:$C,0),0)","v":0},{"$f":"IFERROR(MATCH($A141&\"#\"&P$1,'[1]Pt1-DATA'!$C:$C,0),0)","v":0},{"$f":"IFERROR(MATCH($A141&\"#\"&Q$1,'[1]Pt1-DATA'!$C:$C,0),0)","v":0},{"$f":"IFERROR(MATCH($A141&\"#\"&R$1,'[1]Pt1-DATA'!$C:$C,0),0)","v":0},{"$f":"IFERROR(MATCH($A141&\"#\"&S$1,'[1]Pt1-DATA'!$C:$C,0),0)","v":0},{"$f":"IFERROR(MATCH($A141&\"#\"&T$1,'[1]Pt1-DATA'!$C:$C,0),0)","v":0}]
[104,"Helicopter","Attack","Tiger","Airbus Tiger","MTR MTR390","rotorcraft mil",null,false,null,{"$f":"IFERROR(MATCH($A142&\"#\"&K$1,'[1]Pt1-DATA'!$C:$C,0),0)","v":0},null,{"$f":"IFERROR(MATCH($A142&\"#\"&M$1,'[1]Pt1-DATA'!$C:$C,0),0)","v":0},{"$f":"IFERROR(MATCH($A142&\"#\"&N$1,'[1]Pt1-DATA'!$C:$C,0),0)","v":0},{"$f":"IFERROR(MATCH($A142&\"#\"&O$1,'[1]Pt1-DATA'!$C:$C,0),0)","v":0},{"$f":"IFERROR(MATCH($A142&\"#\"&P$1,'[1]Pt1-DATA'!$C:$C,0),0)","v":0},{"$f":"IFERROR(MATCH($A142&\"#\"&Q$1,'[1]Pt1-DATA'!$C:$C,0),0)","v":0},{"$f":"IFERROR(MATCH($A142&\"#\"&R$1,'[1]Pt1-DATA'!$C:$C,0),0)","v":0},{"$f":"IFERROR(MATCH($A142&\"#\"&S$1,'[1]Pt1-DATA'!$C:$C,0),0)","v":0},{"$f":"IFERROR(MATCH($A142&\"#\"&T$1,'[1]Pt1-DATA'!$C:$C,0),0)","v":0}]
[97,"Helicopter","Attack","V-22","Bell Boeing V-22 Osprey","Rolls-Royce 1107","rotorcraft mil",null,false,null,{"$f":"IFERROR(MATCH($A143&\"#\"&K$1,'[1]Pt1-DATA'!$C:$C,0),0)","v":0},null,{"$f":"IFERROR(MATCH($A143&\"#\"&M$1,'[1]Pt1-DATA'!$C:$C,0),0)","v":0},{"$f":"IFERROR(MATCH($A143&\"#\"&N$1,'[1]Pt1-DATA'!$C:$C,0),0)","v":0},{"$f":"IFERROR(MATCH($A143&\"#\"&O$1,'[1]Pt1-DATA'!$C:$C,0),0)","v":0},{"$f":"IFERROR(MATCH($A143&\"#\"&P$1,'[1]Pt1-DATA'!$C:$C,0),0)","v":0},{"$f":"IFERROR(MATCH($A143&\"#\"&Q$1,'[1]Pt1-DATA'!$C:$C,0),0)","v":0},{"$f":"IFERROR(MATCH($A143&\"#\"&R$1,'[1]Pt1-DATA'!$C:$C,0),0)","v":0},{"$f":"IFERROR(MATCH($A143&\"#\"&S$1,'[1]Pt1-DATA'!$C:$C,0),0)","v":0},{"$f":"IFERROR(MATCH($A143&\"#\"&T$1,'[1]Pt1-DATA'!$C:$C,0),0)","v":0}]
[639,"Helicopter","Attack","WAH-64","Westland WAH-64","Safran RTM322","rotorcraft mil",null,true,null,{"$f":"IFERROR(MATCH($A144&\"#\"&K$1,'[1]Pt1-DATA'!$C:$C,0),0)","v":0},null,{"$f":"IFERROR(MATCH($A144&\"#\"&M$1,'[1]Pt1-DATA'!$C:$C,0),0)","v":0},{"$f":"IFERROR(MATCH($A144&\"#\"&N$1,'[1]Pt1-DATA'!$C:$C,0),0)","v":0},{"$f":"IFERROR(MATCH($A144&\"#\"&O$1,'[1]Pt1-DATA'!$C:$C,0),0)","v":0},{"$f":"IFERROR(MATCH($A144&\"#\"&P$1,'[1]Pt1-DATA'!$C:$C,0),0)","v":0},{"$f":"IFERROR(MATCH($A144&\"#\"&Q$1,'[1]Pt1-DATA'!$C:$C,0),0)","v":0},{"$f":"IFERROR(MATCH($A144&\"#\"&R$1,'[1]Pt1-DATA'!$C:$C,0),0)","v":0},{"$f":"IFERROR(MATCH($A144&\"#\"&S$1,'[1]Pt1-DATA'!$C:$C,0),0)","v":9554},{"$f":"IFERROR(MATCH($A144&\"#\"&T$1,'[1]Pt1-DATA'!$C:$C,0),0)","v":0}]
[646,"Helicopter","Transport & Utility","412X","Bell 412X","Pratt & Whitney Canada PT6T","rotocraft civil",null,false,null,{"$f":"IFERROR(MATCH($A145&\"#\"&K$1,'[1]Pt1-DATA'!$C:$C,0),0)","v":0},null,{"$f":"IFERROR(MATCH($A145&\"#\"&M$1,'[1]Pt1-DATA'!$C:$C,0),0)","v":0},{"$f":"IFERROR(MATCH($A145&\"#\"&N$1,'[1]Pt1-DATA'!$C:$C,0),0)","v":0},{"$f":"IFERROR(MATCH($A145&\"#\"&O$1,'[1]Pt1-DATA'!$C:$C,0),0)","v":0},{"$f":"IFERROR(MATCH($A145&\"#\"&P$1,'[1]Pt1-DATA'!$C:$C,0),0)","v":0},{"$f":"IFERROR(MATCH($A145&\"#\"&Q$1,'[1]Pt1-DATA'!$C:$C,0),0)","v":0},{"$f":"IFERROR(MATCH($A145&\"#\"&R$1,'[1]Pt1-DATA'!$C:$C,0),0)","v":0},{"$f":"IFERROR(MATCH($A145&\"#\"&S$1,'[1]Pt1-DATA'!$C:$C,0),0)","v":0},{"$f":"IFERROR(MATCH($A145&\"#\"&T$1,'[1]Pt1-DATA'!$C:$C,0),0)","v":0}]
[117,"Helicopter","Transport & Utility","Airbus UH-72 Lakota","Airbus UH-72 Lakota","Turbomeca Arriel","rotorcraft mil",null,false,null,{"$f":"IFERROR(MATCH($A146&\"#\"&K$1,'[1]Pt1-DATA'!$C:$C,0),0)","v":0},null,{"$f":"IFERROR(MATCH($A146&\"#\"&M$1,'[1]Pt1-DATA'!$C:$C,0),0)","v":0},{"$f":"IFERROR(MATCH($A146&\"#\"&N$1,'[1]Pt1-DATA'!$C:$C,0),0)","v":0},{"$f":"IFERROR(MATCH($A146&\"#\"&O$1,'[1]Pt1-DATA'!$C:$C,0),0)","v":0},{"$f":"IFERROR(MATCH($A146&\"#\"&P$1,'[1]Pt1-DATA'!$C:$C,0),0)","v":0},{"$f":"IFERROR(MATCH($A146&\"#\"&Q$1,'[1]Pt1-DATA'!$C:$C,0),0)","v":0},{"$f":"IFERROR(MATCH($A146&\"#\"&R$1,'[1]Pt1-DATA'!$C:$C,0),0)","v":0},{"$f":"IFERROR(MATCH($A146&\"#\"&S$1,'[1]Pt1-DATA'!$C:$C,0),0)","v":0},{"$f":"IFERROR(MATCH($A146&\"#\"&T$1,'[1]Pt1-DATA'!$C:$C,0),0)","v":0}]
[90,"Helicopter","Transport & Utility","Bell 407","Bell 407","Allison Model 250 (C)","rotocraft civil",null,false,null,{"$f":"IFERROR(MATCH($A147&\"#\"&K$1,'[1]Pt1-DATA'!$C:$C,0),0)","v":0},null,{"$f":"IFERROR(MATCH($A147&\"#\"&M$1,'[1]Pt1-DATA'!$C:$C,0),0)","v":0},{"$f":"IFERROR(MATCH($A147&\"#\"&N$1,'[1]Pt1-DATA'!$C:$C,0),0)","v":0},{"$f":"IFERROR(MATCH($A147&\"#\"&O$1,'[1]Pt1-DATA'!$C:$C,0),0)","v":0},{"$f":"IFERROR(MATCH($A147&\"#\"&P$1,'[1]Pt1-DATA'!$C:$C,0),0)","v":0},{"$f":"IFERROR(MATCH($A147&\"#\"&Q$1,'[1]Pt1-DATA'!$C:$C,0),0)","v":0},{"$f":"IFERROR(MATCH($A147&\"#\"&R$1,'[1]Pt1-DATA'!$C:$C,0),0)","v":0},{"$f":"IFERROR(MATCH($A147&\"#\"&S$1,'[1]Pt1-DATA'!$C:$C,0),0)","v":0},{"$f":"IFERROR(MATCH($A147&\"#\"&T$1,'[1]Pt1-DATA'!$C:$C,0),0)","v":0}]
[583,"Helicopter","Transport & Utility","Bell 412","Subaru/Bell 412","Pratt & Whitney Canada PT6T","rotocraft civil",null,false,null,{"$f":"IFERROR(MATCH($A148&\"#\"&K$1,'[1]Pt1-DATA'!$C:$C,0),0)","v":0},null,{"$f":"IFERROR(MATCH($A148&\"#\"&M$1,'[1]Pt1-DATA'!$C:$C,0),0)","v":0},{"$f":"IFERROR(MATCH($A148&\"#\"&N$1,'[1]Pt1-DATA'!$C:$C,0),0)","v":0},{"$f":"IFERROR(MATCH($A148&\"#\"&O$1,'[1]Pt1-DATA'!$C:$C,0),0)","v":0},{"$f":"IFERROR(MATCH($A148&\"#\"&P$1,'[1]Pt1-DATA'!$C:$C,0),0)","v":0},{"$f":"IFERROR(MATCH($A148&\"#\"&Q$1,'[1]Pt1-DATA'!$C:$C,0),0)","v":0},{"$f":"IFERROR(MATCH($A148&\"#\"&R$1,'[1]Pt1-DATA'!$C:$C,0),0)","v":0},{"$f":"IFERROR(MATCH($A148&\"#\"&S$1,'[1]Pt1-DATA'!$C:$C,0),0)","v":0},{"$f":"IFERROR(MATCH($A148&\"#\"&T$1,'[1]Pt1-DATA'!$C:$C,0),0)","v":0}]
[91,"Helicopter","Transport & Utility","Bell 429 GlobalRanger","Bell 429 GlobalRanger","Pratt & Whitney Canada PW207","rotocraft civil",null,false,null,{"$f":"IFERROR(MATCH($A149&\"#\"&K$1,'[1]Pt1-DATA'!$C:$C,0),0)","v":0},null,{"$f":"IFERROR(MATCH($A149&\"#\"&M$1,'[1]Pt1-DATA'!$C:$C,0),0)","v":0},{"$f":"IFERROR(MATCH($A149&\"#\"&N$1,'[1]Pt1-DATA'!$C:$C,0),0)","v":0},{"$f":"IFERROR(MATCH($A149&\"#\"&O$1,'[1]Pt1-DATA'!$C:$C,0),0)","v":0},{"$f":"IFERROR(MATCH($A149&\"#\"&P$1,'[1]Pt1-DATA'!$C:$C,0),0)","v":0},{"$f":"IFERROR(MATCH($A149&\"#\"&Q$1,'[1]Pt1-DATA'!$C:$C,0),0)","v":0},{"$f":"IFERROR(MATCH($A149&\"#\"&R$1,'[1]Pt1-DATA'!$C:$C,0),0)","v":0},{"$f":"IFERROR(MATCH($A149&\"#\"&S$1,'[1]Pt1-DATA'!$C:$C,0),0)","v":0},{"$f":"IFERROR(MATCH($A149&\"#\"&T$1,'[1]Pt1-DATA'!$C:$C,0),0)","v":0}]
[89,"Helicopter","Transport & Utility","Bell 505 Jet Ranger X","Bell 505 Jet Ranger X","Turbomeca Arrius","rotocraft civil",null,false,null,{"$f":"IFERROR(MATCH($A150&\"#\"&K$1,'[1]Pt1-DATA'!$C:$C,0),0)","v":0},null,{"$f":"IFERROR(MATCH($A150&\"#\"&M$1,'[1]Pt1-DATA'!$C:$C,0),0)","v":0},{"$f":"IFERROR(MATCH($A150&\"#\"&N$1,'[1]Pt1-DATA'!$C:$C,0),0)","v":0},{"$f":"IFERROR(MATCH($A150&\"#\"&O$1,'[1]Pt1-DATA'!$C:$C,0),0)","v":0},{"$f":"IFERROR(MATCH($A150&\"#\"&P$1,'[1]Pt1-DATA'!$C:$C,0),0)","v":0},{"$f":"IFERROR(MATCH($A150&\"#\"&Q$1,'[1]Pt1-DATA'!$C:$C,0),0)","v":0},{"$f":"IFERROR(MATCH($A150&\"#\"&R$1,'[1]Pt1-DATA'!$C:$C,0),0)","v":0},{"$f":"IFERROR(MATCH($A150&\"#\"&S$1,'[1]Pt1-DATA'!$C:$C,0),0)","v":0},{"$f":"IFERROR(MATCH($A150&\"#\"&T$1,'[1]Pt1-DATA'!$C:$C,0),0)","v":0}]
[93,"Helicopter","Transport & Utility","Bell 525 Relentless","Bell 525 Relentless","General Electric T700","rotocraft civil",null,false,null,{"$f":"IFERROR(MATCH($A151&\"#\"&K$1,'[1]Pt1-DATA'!$C:$C,0),0)","v":0},null,{"$f":"IFERROR(MATCH($A151&\"#\"&M$1,'[1]Pt1-DATA'!$C:$C,0),0)","v":0},{"$f":"IFERROR(MATCH($A151&\"#\"&N$1,'[1]Pt1-DATA'!$C:$C,0),0)","v":0},{"$f":"IFERROR(MATCH($A151&\"#\"&O$1,'[1]Pt1-DATA'!$C:$C,0),0)","v":0},{"$f":"IFERROR(MATCH($A151&\"#\"&P$1,'[1]Pt1-DATA'!$C:$C,0),0)","v":0},{"$f":"IFERROR(MATCH($A151&\"#\"&Q$1,'[1]Pt1-DATA'!$C:$C,0),0)","v":0},{"$f":"IFERROR(MATCH($A151&\"#\"&R$1,'[1]Pt1-DATA'!$C:$C,0),0)","v":0},{"$f":"IFERROR(MATCH($A151&\"#\"&S$1,'[1]Pt1-DATA'!$C:$C,0),0)","v":0},{"$f":"IFERROR(MATCH($A151&\"#\"&T$1,'[1]Pt1-DATA'!$C:$C,0),0)","v":0}]
[100,"Helicopter","Transport & Utility","CH-47","Boeing CH-47 Chinook","Lycoming T55","rotorcraft mil",null,true,null,{"$f":"IFERROR(MATCH($A152&\"#\"&K$1,'[1]Pt1-DATA'!$C:$C,0),0)","v":0},null,{"$f":"IFERROR(MATCH($A152&\"#\"&M$1,'[1]Pt1-DATA'!$C:$C,0),0)","v":0},{"$f":"IFERROR(MATCH($A152&\"#\"&N$1,'[1]Pt1-DATA'!$C:$C,0),0)","v":0},{"$f":"IFERROR(MATCH($A152&\"#\"&O$1,'[1]Pt1-DATA'!$C:$C,0),0)","v":0},{"$f":"IFERROR(MATCH($A152&\"#\"&P$1,'[1]Pt1-DATA'!$C:$C,0),0)","v":0},{"$f":"IFERROR(MATCH($A152&\"#\"&Q$1,'[1]Pt1-DATA'!$C:$C,0),0)","v":0},{"$f":"IFERROR(MATCH($A152&\"#\"&R$1,'[1]Pt1-DATA'!$C:$C,0),0)","v":0},{"$f":"IFERROR(MATCH($A152&\"#\"&S$1,'[1]Pt1-DATA'!$C:$C,0),0)","v":9555},{"$f":"IFERROR(MATCH($A152&\"#\"&T$1,'[1]Pt1-DATA'!$C:$C,0),0)","v":0}]
[101,"Helicopter","Transport & Utility","CH-47","Boeing CH-47 Chinook (reman)","Lycoming T55","rotorcraft mil",null,true,null,{"$f":"IFERROR(MATCH($A153&\"#\"&K$1,'[1]Pt1-DATA'!$C:$C,0),0)","v":0},null,{"$f":"IFERROR(MATCH($A153&\"#\"&M$1,'[1]Pt1-DATA'!$C:$C,0),0)","v":0},{"$f":"IFERROR(MATCH($A153&\"#\"&N$1,'[1]Pt1-DATA'!$C:$C,0),0)","v":0},{"$f":"IFERROR(MATCH($A153&\"#\"&O$1,'[1]Pt1-DATA'!$C:$C,0),0)","v":0},{"$f":"IFERROR(MATCH($A153&\"#\"&P$1,'[1]Pt1-DATA'!$C:$C,0),0)","v":0},{"$f":"IFERROR(MATCH($A153&\"#\"&Q$1,'[1]Pt1-DATA'!$C:$C,0),0)","v":0},{"$f":"IFERROR(MATCH($A153&\"#\"&R$1,'[1]Pt1-DATA'!$C:$C,0),0)","v":0},{"$f":"IFERROR(MATCH($A153&\"#\"&S$1,'[1]Pt1-DATA'!$C:$C,0),0)","v":9556},{"$f":"IFERROR(MATCH($A153&\"#\"&T$1,'[1]Pt1-DATA'!$C:$C,0),0)","v":0}]
[112,"Helicopter","Transport & Utility","H120 Colibri","Airbus H120 Colibri","Turbomeca Arrius","rotocraft civil",null,false,null,{"$f":"IFERROR(MATCH($A154&\"#\"&K$1,'[1]Pt1-DATA'!$C:$C,0),0)","v":0},null,{"$f":"IFERROR(MATCH($A154&\"#\"&M$1,'[1]Pt1-DATA'!$C:$C,0),0)","v":0},{"$f":"IFERROR(MATCH($A154&\"#\"&N$1,'[1]Pt1-DATA'!$C:$C,0),0)","v":0},{"$f":"IFERROR(MATCH($A154&\"#\"&O$1,'[1]Pt1-DATA'!$C:$C,0),0)","v":0},{"$f":"IFERROR(MATCH($A154&\"#\"&P$1,'[1]Pt1-DATA'!$C:$C,0),0)","v":0},{"$f":"IFERROR(MATCH($A154&\"#\"&Q$1,'[1]Pt1-DATA'!$C:$C,0),0)","v":0},{"$f":"IFERROR(MATCH($A154&\"#\"&R$1,'[1]Pt1-DATA'!$C:$C,0),0)","v":0},{"$f":"IFERROR(MATCH($A154&\"#\"&S$1,'[1]Pt1-DATA'!$C:$C,0),0)","v":0},{"$f":"IFERROR(MATCH($A154&\"#\"&T$1,'[1]Pt1-DATA'!$C:$C,0),0)","v":0}]
[107,"Helicopter","Transport & Utility","H125","Airbus H125","Turbomeca Arriel","rotocraft civil",null,false,null,{"$f":"IFERROR(MATCH($A155&\"#\"&K$1,'[1]Pt1-DATA'!$C:$C,0),0)","v":0},null,{"$f":"IFERROR(MATCH($A155&\"#\"&M$1,'[1]Pt1-DATA'!$C:$C,0),0)","v":0},{"$f":"IFERROR(MATCH($A155&\"#\"&N$1,'[1]Pt1-DATA'!$C:$C,0),0)","v":0},{"$f":"IFERROR(MATCH($A155&\"#\"&O$1,'[1]Pt1-DATA'!$C:$C,0),0)","v":0},{"$f":"IFERROR(MATCH($A155&\"#\"&P$1,'[1]Pt1-DATA'!$C:$C,0),0)","v":0},{"$f":"IFERROR(MATCH($A155&\"#\"&Q$1,'[1]Pt1-DATA'!$C:$C,0),0)","v":0},{"$f":"IFERROR(MATCH($A155&\"#\"&R$1,'[1]Pt1-DATA'!$C:$C,0),0)","v":0},{"$f":"IFERROR(MATCH($A155&\"#\"&S$1,'[1]Pt1-DATA'!$C:$C,0),0)","v":0},{"$f":"IFERROR(MATCH($A155&\"#\"&T$1,'[1]Pt1-DATA'!$C:$C,0),0)","v":0}]
[108,"Helicopter","Transport & Utility","H130","Airbus H130","Turbomeca Arriel","rotocraft civil",null,false,null,{"$f":"IFERROR(MATCH($A156&\"#\"&K$1,'[1]Pt1-DATA'!$C:$C,0),0)","v":0},null,{"$f":"IFERROR(MATCH($A156&\"#\"&M$1,'[1]Pt1-DATA'!$C:$C,0),0)","v":0},{"$f":"IFERROR(MATCH($A156&\"#\"&N$1,'[1]Pt1-DATA'!$C:$C,0),0)","v":0},{"$f":"IFERROR(MATCH($A156&\"#\"&O$1,'[1]Pt1-DATA'!$C:$C,0),0)","v":0},{"$f":"IFERROR(MATCH($A156&\"#\"&P$1,'[1]Pt1-DATA'!$C:$C,0),0)","v":0},{"$f":"IFERROR(MATCH($A156&\"#\"&Q$1,'[1]Pt1-DATA'!$C:$C,0),0)","v":0},{"$f":"IFERROR(MATCH($A156&\"#\"&R$1,'[1]Pt1-DATA'!$C:$C,0),0)","v":0},{"$f":"IFERROR(MATCH($A156&\"#\"&S$1,'[1]Pt1-DATA'!$C:$C,0),0)","v":0},{"$f":"IFERROR(MATCH($A156&\"#\"&T$1,'[1]Pt1-DATA'!$C:$C,0),0)","v":0}]
[483,"Helicopter","Transport & Utility","H135","Airbus H135","Pratt & Whitney Canada PW206","rotocraft civil",null,false,null,{"$f":"IFERROR(MATCH($A157&\"#\"&K$1,'[1]Pt1-DATA'!$C:$C,0),0)","v":0},null,{"$f":"IFERROR(MATCH($A157&\"#\"&M$1,'[1]Pt1-DATA'!$C:$C,0),0)","v":0},{"$f":"IFERROR(MATCH($A157&\"#\"&N$1,'[1]Pt1-DATA'!$C:$C,0),0)","v":0},{"$f":"IFERROR(MATCH($A157&\"#\"&O$1,'[1]Pt1-DATA'!$C:$C,0),0)","v":0},{"$f":"IFERROR(MATCH($A157&\"#\"&P$1,'[1]Pt1-DATA'!$C:$C,0),0)","v":0},{"$f":"IFERROR(MATCH($A157&\"#\"&Q$1,'[1]Pt1-DATA'!$C:$C,0),0)","v":0},{"$f":"IFERROR(MATCH($A157&\"#\"&R$1,'[1]Pt1-DATA'!$C:$C,0),0)","v":0},{"$f":"IFERROR(MATCH($A157&\"#\"&S$1,'[1]Pt1-DATA'!$C:$C,0),0)","v":0},{"$f":"IFERROR(MATCH($A157&\"#\"&T$1,'[1]Pt1-DATA'!$C:$C,0),0)","v":0}]
[111,"Helicopter","Transport & Utility","H135","Airbus H135","Turbomeca Arrius","rotocraft civil",null,false,null,{"$f":"IFERROR(MATCH($A158&\"#\"&K$1,'[1]Pt1-DATA'!$C:$C,0),0)","v":0},null,{"$f":"IFERROR(MATCH($A158&\"#\"&M$1,'[1]Pt1-DATA'!$C:$C,0),0)","v":0},{"$f":"IFERROR(MATCH($A158&\"#\"&N$1,'[1]Pt1-DATA'!$C:$C,0),0)","v":0},{"$f":"IFERROR(MATCH($A158&\"#\"&O$1,'[1]Pt1-DATA'!$C:$C,0),0)","v":0},{"$f":"IFERROR(MATCH($A158&\"#\"&P$1,'[1]Pt1-DATA'!$C:$C,0),0)","v":0},{"$f":"IFERROR(MATCH($A158&\"#\"&Q$1,'[1]Pt1-DATA'!$C:$C,0),0)","v":0},{"$f":"IFERROR(MATCH($A158&\"#\"&R$1,'[1]Pt1-DATA'!$C:$C,0),0)","v":0},{"$f":"IFERROR(MATCH($A158&\"#\"&S$1,'[1]Pt1-DATA'!$C:$C,0),0)","v":0},{"$f":"IFERROR(MATCH($A158&\"#\"&T$1,'[1]Pt1-DATA'!$C:$C,0),0)","v":0}]
[113,"Helicopter","Transport & Utility","H145","Airbus H145/Kawasaki BK117","Turbomeca Arriel","rotocraft civil",null,false,null,{"$f":"IFERROR(MATCH($A159&\"#\"&K$1,'[1]Pt1-DATA'!$C:$C,0),0)","v":0},null,{"$f":"IFERROR(MATCH($A159&\"#\"&M$1,'[1]Pt1-DATA'!$C:$C,0),0)","v":0},{"$f":"IFERROR(MATCH($A159&\"#\"&N$1,'[1]Pt1-DATA'!$C:$C,0),0)","v":0},{"$f":"IFERROR(MATCH($A159&\"#\"&O$1,'[1]Pt1-DATA'!$C:$C,0),0)","v":0},{"$f":"IFERROR(MATCH($A159&\"#\"&P$1,'[1]Pt1-DATA'!$C:$C,0),0)","v":0},{"$f":"IFERROR(MATCH($A159&\"#\"&Q$1,'[1]Pt1-DATA'!$C:$C,0),0)","v":0},{"$f":"IFERROR(MATCH($A159&\"#\"&R$1,'[1]Pt1-DATA'!$C:$C,0),0)","v":0},{"$f":"IFERROR(MATCH($A159&\"#\"&S$1,'[1]Pt1-DATA'!$C:$C,0),0)","v":0},{"$f":"IFERROR(MATCH($A159&\"#\"&T$1,'[1]Pt1-DATA'!$C:$C,0),0)","v":0}]
[109,"Helicopter","Transport & Utility","H155","Airbus H155","Turbomeca Arriel","rotocraft civil",null,false,null,{"$f":"IFERROR(MATCH($A160&\"#\"&K$1,'[1]Pt1-DATA'!$C:$C,0),0)","v":0},null,{"$f":"IFERROR(MATCH($A160&\"#\"&M$1,'[1]Pt1-DATA'!$C:$C,0),0)","v":0},{"$f":"IFERROR(MATCH($A160&\"#\"&N$1,'[1]Pt1-DATA'!$C:$C,0),0)","v":0},{"$f":"IFERROR(MATCH($A160&\"#\"&O$1,'[1]Pt1-DATA'!$C:$C,0),0)","v":0},{"$f":"IFERROR(MATCH($A160&\"#\"&P$1,'[1]Pt1-DATA'!$C:$C,0),0)","v":0},{"$f":"IFERROR(MATCH($A160&\"#\"&Q$1,'[1]Pt1-DATA'!$C:$C,0),0)","v":0},{"$f":"IFERROR(MATCH($A160&\"#\"&R$1,'[1]Pt1-DATA'!$C:$C,0),0)","v":0},{"$f":"IFERROR(MATCH($A160&\"#\"&S$1,'[1]Pt1-DATA'!$C:$C,0),0)","v":0},{"$f":"IFERROR(MATCH($A160&\"#\"&T$1,'[1]Pt1-DATA'!$C:$C,0),0)","v":0}]
[110,"Helicopter","Transport & Utility","H160","Airbus H160","Turbomeca Arrano","rotocraft civil",null,false,null,{"$f":"IFERROR(MATCH($A161&\"#\"&K$1,'[1]Pt1-DATA'!$C:$C,0),0)","v":0},null,{"$f":"IFERROR(MATCH($A161&\"#\"&M$1,'[1]Pt1-DATA'!$C:$C,0),0)","v":0},{"$f":"IFERROR(MATCH($A161&\"#\"&N$1,'[1]Pt1-DATA'!$C:$C,0),0)","v":0},{"$f":"IFERROR(MATCH($A161&\"#\"&O$1,'[1]Pt1-DATA'!$C:$C,0),0)","v":0},{"$f":"IFERROR(MATCH($A161&\"#\"&P$1,'[1]Pt1-DATA'!$C:$C,0),0)","v":0},{"$f":"IFERROR(MATCH($A161&\"#\"&Q$1,'[1]Pt1-DATA'!$C:$C,0),0)","v":0},{"$f":"IFERROR(MATCH($A161&\"#\"&R$1,'[1]Pt1-DATA'!$C:$C,0),0)","v":0},{"$f":"IFERROR(MATCH($A161&\"#\"&S$1,'[1]Pt1-DATA'!$C:$C,0),0)","v":0},{"$f":"IFERROR(MATCH($A161&\"#\"&T$1,'[1]Pt1-DATA'!$C:$C,0),0)","v":0}]
[102,"Helicopter","Transport & Utility","H175","Airbus H175","Pratt & Whitney Canada PT6C","rotocraft civil",null,false,null,{"$f":"IFERROR(MATCH($A162&\"#\"&K$1,'[1]Pt1-DATA'!$C:$C,0),0)","v":0},null,{"$f":"IFERROR(MATCH($A162&\"#\"&M$1,'[1]Pt1-DATA'!$C:$C,0),0)","v":0},{"$f":"IFERROR(MATCH($A162&\"#\"&N$1,'[1]Pt1-DATA'!$C:$C,0),0)","v":0},{"$f":"IFERROR(MATCH($A162&\"#\"&O$1,'[1]Pt1-DATA'!$C:$C,0),0)","v":0},{"$f":"IFERROR(MATCH($A162&\"#\"&P$1,'[1]Pt1-DATA'!$C:$C,0),0)","v":0},{"$f":"IFERROR(MATCH($A162&\"#\"&Q$1,'[1]Pt1-DATA'!$C:$C,0),0)","v":0},{"$f":"IFERROR(MATCH($A162&\"#\"&R$1,'[1]Pt1-DATA'!$C:$C,0),0)","v":0},{"$f":"IFERROR(MATCH($A162&\"#\"&S$1,'[1]Pt1-DATA'!$C:$C,0),0)","v":0},{"$f":"IFERROR(MATCH($A162&\"#\"&T$1,'[1]Pt1-DATA'!$C:$C,0),0)","v":0}]
[105,"Helicopter","Transport & Utility","H215 / H225","Airbus H215 / H225","Turbomeca Makila","rotocraft civil",null,false,null,{"$f":"IFERROR(MATCH($A163&\"#\"&K$1,'[1]Pt1-DATA'!$C:$C,0),0)","v":0},null,{"$f":"IFERROR(MATCH($A163&\"#\"&M$1,'[1]Pt1-DATA'!$C:$C,0),0)","v":0},{"$f":"IFERROR(MATCH($A163&\"#\"&N$1,'[1]Pt1-DATA'!$C:$C,0),0)","v":0},{"$f":"IFERROR(MATCH($A163&\"#\"&O$1,'[1]Pt1-DATA'!$C:$C,0),0)","v":0},{"$f":"IFERROR(MATCH($A163&\"#\"&P$1,'[1]Pt1-DATA'!$C:$C,0),0)","v":0},{"$f":"IFERROR(MATCH($A163&\"#\"&Q$1,'[1]Pt1-DATA'!$C:$C,0),0)","v":0},{"$f":"IFERROR(MATCH($A163&\"#\"&R$1,'[1]Pt1-DATA'!$C:$C,0),0)","v":0},{"$f":"IFERROR(MATCH($A163&\"#\"&S$1,'[1]Pt1-DATA'!$C:$C,0),0)","v":0},{"$f":"IFERROR(MATCH($A163&\"#\"&T$1,'[1]Pt1-DATA'!$C:$C,0),0)","v":0}]
[106,"Helicopter","Transport & Utility","H355","Airbus H355","Allison Model 250 (C)","rotocraft civil",null,false,null,{"$f":"IFERROR(MATCH($A164&\"#\"&K$1,'[1]Pt1-DATA'!$C:$C,0),0)","v":0},null,{"$f":"IFERROR(MATCH($A164&\"#\"&M$1,'[1]Pt1-DATA'!$C:$C,0),0)","v":0},{"$f":"IFERROR(MATCH($A164&\"#\"&N$1,'[1]Pt1-DATA'!$C:$C,0),0)","v":0},{"$f":"IFERROR(MATCH($A164&\"#\"&O$1,'[1]Pt1-DATA'!$C:$C,0),0)","v":0},{"$f":"IFERROR(MATCH($A164&\"#\"&P$1,'[1]Pt1-DATA'!$C:$C,0),0)","v":0},{"$f":"IFERROR(MATCH($A164&\"#\"&Q$1,'[1]Pt1-DATA'!$C:$C,0),0)","v":0},{"$f":"IFERROR(MATCH($A164&\"#\"&R$1,'[1]Pt1-DATA'!$C:$C,0),0)","v":0},{"$f":"IFERROR(MATCH($A164&\"#\"&S$1,'[1]Pt1-DATA'!$C:$C,0),0)","v":0},{"$f":"IFERROR(MATCH($A164&\"#\"&T$1,'[1]Pt1-DATA'!$C:$C,0),0)","v":0}]
[116,"Helicopter","Transport & Utility","HAL Dhruv","HAL Dhruv","HAL/Turbomeca Shakti","rotocraft civil",null,false,null,{"$f":"IFERROR(MATCH($A165&\"#\"&K$1,'[1]Pt1-DATA'!$C:$C,0),0)","v":0},null,{"$f":"IFERROR(MATCH($A165&\"#\"&M$1,'[1]Pt1-DATA'!$C:$C,0),0)","v":0},{"$f":"IFERROR(MATCH($A165&\"#\"&N$1,'[1]Pt1-DATA'!$C:$C,0),0)","v":0},{"$f":"IFERROR(MATCH($A165&\"#\"&O$1,'[1]Pt1-DATA'!$C:$C,0),0)","v":0},{"$f":"IFERROR(MATCH($A165&\"#\"&P$1,'[1]Pt1-DATA'!$C:$C,0),0)","v":0},{"$f":"IFERROR(MATCH($A165&\"#\"&Q$1,'[1]Pt1-DATA'!$C:$C,0),0)","v":0},{"$f":"IFERROR(MATCH($A165&\"#\"&R$1,'[1]Pt1-DATA'!$C:$C,0),0)","v":0},{"$f":"IFERROR(MATCH($A165&\"#\"&S$1,'[1]Pt1-DATA'!$C:$C,0),0)","v":0},{"$f":"IFERROR(MATCH($A165&\"#\"&T$1,'[1]Pt1-DATA'!$C:$C,0),0)","v":0}]
[488,"Helicopter","Transport & Utility","HAL Dhruv","HAL Dhruv","Turbomeca Arriel","rotocraft civil",null,false,null,{"$f":"IFERROR(MATCH($A166&\"#\"&K$1,'[1]Pt1-DATA'!$C:$C,0),0)","v":0},null,{"$f":"IFERROR(MATCH($A166&\"#\"&M$1,'[1]Pt1-DATA'!$C:$C,0),0)","v":0},{"$f":"IFERROR(MATCH($A166&\"#\"&N$1,'[1]Pt1-DATA'!$C:$C,0),0)","v":0},{"$f":"IFERROR(MATCH($A166&\"#\"&O$1,'[1]Pt1-DATA'!$C:$C,0),0)","v":0},{"$f":"IFERROR(MATCH($A166&\"#\"&P$1,'[1]Pt1-DATA'!$C:$C,0),0)","v":0},{"$f":"IFERROR(MATCH($A166&\"#\"&Q$1,'[1]Pt1-DATA'!$C:$C,0),0)","v":0},{"$f":"IFERROR(MATCH($A166&\"#\"&R$1,'[1]Pt1-DATA'!$C:$C,0),0)","v":0},{"$f":"IFERROR(MATCH($A166&\"#\"&S$1,'[1]Pt1-DATA'!$C:$C,0),0)","v":0},{"$f":"IFERROR(MATCH($A166&\"#\"&T$1,'[1]Pt1-DATA'!$C:$C,0),0)","v":0}]
[490,"Helicopter","Transport & Utility","HAL Dhruv","HAL Dhruv","Turbomeca TM 333","rotocraft civil",null,false,null,{"$f":"IFERROR(MATCH($A167&\"#\"&K$1,'[1]Pt1-DATA'!$C:$C,0),0)","v":0},null,{"$f":"IFERROR(MATCH($A167&\"#\"&M$1,'[1]Pt1-DATA'!$C:$C,0),0)","v":0},{"$f":"IFERROR(MATCH($A167&\"#\"&N$1,'[1]Pt1-DATA'!$C:$C,0),0)","v":0},{"$f":"IFERROR(MATCH($A167&\"#\"&O$1,'[1]Pt1-DATA'!$C:$C,0),0)","v":0},{"$f":"IFERROR(MATCH($A167&\"#\"&P$1,'[1]Pt1-DATA'!$C:$C,0),0)","v":0},{"$f":"IFERROR(MATCH($A167&\"#\"&Q$1,'[1]Pt1-DATA'!$C:$C,0),0)","v":0},{"$f":"IFERROR(MATCH($A167&\"#\"&R$1,'[1]Pt1-DATA'!$C:$C,0),0)","v":0},{"$f":"IFERROR(MATCH($A167&\"#\"&S$1,'[1]Pt1-DATA'!$C:$C,0),0)","v":0},{"$f":"IFERROR(MATCH($A167&\"#\"&T$1,'[1]Pt1-DATA'!$C:$C,0),0)","v":0}]
[137,"Helicopter","Transport & Utility","HAL Light Utility Helicopter","HAL Light Utility Helicopter","Turbomeca Arrius","rotorcraft mil",null,false,null,{"$f":"IFERROR(MATCH($A168&\"#\"&K$1,'[1]Pt1-DATA'!$C:$C,0),0)","v":0},null,{"$f":"IFERROR(MATCH($A168&\"#\"&M$1,'[1]Pt1-DATA'!$C:$C,0),0)","v":0},{"$f":"IFERROR(MATCH($A168&\"#\"&N$1,'[1]Pt1-DATA'!$C:$C,0),0)","v":0},{"$f":"IFERROR(MATCH($A168&\"#\"&O$1,'[1]Pt1-DATA'!$C:$C,0),0)","v":0},{"$f":"IFERROR(MATCH($A168&\"#\"&P$1,'[1]Pt1-DATA'!$C:$C,0),0)","v":0},{"$f":"IFERROR(MATCH($A168&\"#\"&Q$1,'[1]Pt1-DATA'!$C:$C,0),0)","v":0},{"$f":"IFERROR(MATCH($A168&\"#\"&R$1,'[1]Pt1-DATA'!$C:$C,0),0)","v":0},{"$f":"IFERROR(MATCH($A168&\"#\"&S$1,'[1]Pt1-DATA'!$C:$C,0),0)","v":0},{"$f":"IFERROR(MATCH($A168&\"#\"&T$1,'[1]Pt1-DATA'!$C:$C,0),0)","v":0}]
[136,"Helicopter","Transport & Utility","HAL Medium Lift","HAL Medium Lift","Unknown","rotocraft civil",null,false,null,{"$f":"IFERROR(MATCH($A169&\"#\"&K$1,'[1]Pt1-DATA'!$C:$C,0),0)","v":0},null,{"$f":"IFERROR(MATCH($A169&\"#\"&M$1,'[1]Pt1-DATA'!$C:$C,0),0)","v":0},{"$f":"IFERROR(MATCH($A169&\"#\"&N$1,'[1]Pt1-DATA'!$C:$C,0),0)","v":0},{"$f":"IFERROR(MATCH($A169&\"#\"&O$1,'[1]Pt1-DATA'!$C:$C,0),0)","v":0},{"$f":"IFERROR(MATCH($A169&\"#\"&P$1,'[1]Pt1-DATA'!$C:$C,0),0)","v":0},{"$f":"IFERROR(MATCH($A169&\"#\"&Q$1,'[1]Pt1-DATA'!$C:$C,0),0)","v":0},{"$f":"IFERROR(MATCH($A169&\"#\"&R$1,'[1]Pt1-DATA'!$C:$C,0),0)","v":0},{"$f":"IFERROR(MATCH($A169&\"#\"&S$1,'[1]Pt1-DATA'!$C:$C,0),0)","v":0},{"$f":"IFERROR(MATCH($A169&\"#\"&T$1,'[1]Pt1-DATA'!$C:$C,0),0)","v":0}]
[114,"Helicopter","Transport & Utility","KAI KUH-1 Surion","KAI KUH-1 Surion","General Electric T700","rotocraft civil",null,false,null,{"$f":"IFERROR(MATCH($A170&\"#\"&K$1,'[1]Pt1-DATA'!$C:$C,0),0)","v":0},null,{"$f":"IFERROR(MATCH($A170&\"#\"&M$1,'[1]Pt1-DATA'!$C:$C,0),0)","v":0},{"$f":"IFERROR(MATCH($A170&\"#\"&N$1,'[1]Pt1-DATA'!$C:$C,0),0)","v":0},{"$f":"IFERROR(MATCH($A170&\"#\"&O$1,'[1]Pt1-DATA'!$C:$C,0),0)","v":0},{"$f":"IFERROR(MATCH($A170&\"#\"&P$1,'[1]Pt1-DATA'!$C:$C,0),0)","v":0},{"$f":"IFERROR(MATCH($A170&\"#\"&Q$1,'[1]Pt1-DATA'!$C:$C,0),0)","v":0},{"$f":"IFERROR(MATCH($A170&\"#\"&R$1,'[1]Pt1-DATA'!$C:$C,0),0)","v":0},{"$f":"IFERROR(MATCH($A170&\"#\"&S$1,'[1]Pt1-DATA'!$C:$C,0),0)","v":0},{"$f":"IFERROR(MATCH($A170&\"#\"&T$1,'[1]Pt1-DATA'!$C:$C,0),0)","v":0}]
[115,"Helicopter","Transport & Utility","KAI KUH-1 Surion","KAI LAH/LCH","Turbomeca Arriel","rotocraft civil",null,false,null,{"$f":"IFERROR(MATCH($A171&\"#\"&K$1,'[1]Pt1-DATA'!$C:$C,0),0)","v":0},null,{"$f":"IFERROR(MATCH($A171&\"#\"&M$1,'[1]Pt1-DATA'!$C:$C,0),0)","v":0},{"$f":"IFERROR(MATCH($A171&\"#\"&N$1,'[1]Pt1-DATA'!$C:$C,0),0)","v":0},{"$f":"IFERROR(MATCH($A171&\"#\"&O$1,'[1]Pt1-DATA'!$C:$C,0),0)","v":0},{"$f":"IFERROR(MATCH($A171&\"#\"&P$1,'[1]Pt1-DATA'!$C:$C,0),0)","v":0},{"$f":"IFERROR(MATCH($A171&\"#\"&Q$1,'[1]Pt1-DATA'!$C:$C,0),0)","v":0},{"$f":"IFERROR(MATCH($A171&\"#\"&R$1,'[1]Pt1-DATA'!$C:$C,0),0)","v":0},{"$f":"IFERROR(MATCH($A171&\"#\"&S$1,'[1]Pt1-DATA'!$C:$C,0),0)","v":0},{"$f":"IFERROR(MATCH($A171&\"#\"&T$1,'[1]Pt1-DATA'!$C:$C,0),0)","v":0}]
[223,"Helicopter","Transport & Utility","Kawasaki BK 117","Kawasaki BK 117","Turbomeca Arriel","rotocraft civil",null,false,null,{"$f":"IFERROR(MATCH($A172&\"#\"&K$1,'[1]Pt1-DATA'!$C:$C,0),0)","v":0},null,{"$f":"IFERROR(MATCH($A172&\"#\"&M$1,'[1]Pt1-DATA'!$C:$C,0),0)","v":0},{"$f":"IFERROR(MATCH($A172&\"#\"&N$1,'[1]Pt1-DATA'!$C:$C,0),0)","v":0},{"$f":"IFERROR(MATCH($A172&\"#\"&O$1,'[1]Pt1-DATA'!$C:$C,0),0)","v":0},{"$f":"IFERROR(MATCH($A172&\"#\"&P$1,'[1]Pt1-DATA'!$C:$C,0),0)","v":0},{"$f":"IFERROR(MATCH($A172&\"#\"&Q$1,'[1]Pt1-DATA'!$C:$C,0),0)","v":0},{"$f":"IFERROR(MATCH($A172&\"#\"&R$1,'[1]Pt1-DATA'!$C:$C,0),0)","v":0},{"$f":"IFERROR(MATCH($A172&\"#\"&S$1,'[1]Pt1-DATA'!$C:$C,0),0)","v":0},{"$f":"IFERROR(MATCH($A172&\"#\"&T$1,'[1]Pt1-DATA'!$C:$C,0),0)","v":0}]
[118,"Helicopter","Transport & Utility","Kawasaki OH-1","Kawasaki OH-1","Mitsubishi TS1","rotorcraft mil",null,false,null,{"$f":"IFERROR(MATCH($A173&\"#\"&K$1,'[1]Pt1-DATA'!$C:$C,0),0)","v":0},null,{"$f":"IFERROR(MATCH($A173&\"#\"&M$1,'[1]Pt1-DATA'!$C:$C,0),0)","v":0},{"$f":"IFERROR(MATCH($A173&\"#\"&N$1,'[1]Pt1-DATA'!$C:$C,0),0)","v":0},{"$f":"IFERROR(MATCH($A173&\"#\"&O$1,'[1]Pt1-DATA'!$C:$C,0),0)","v":0},{"$f":"IFERROR(MATCH($A173&\"#\"&P$1,'[1]Pt1-DATA'!$C:$C,0),0)","v":0},{"$f":"IFERROR(MATCH($A173&\"#\"&Q$1,'[1]Pt1-DATA'!$C:$C,0),0)","v":0},{"$f":"IFERROR(MATCH($A173&\"#\"&R$1,'[1]Pt1-DATA'!$C:$C,0),0)","v":0},{"$f":"IFERROR(MATCH($A173&\"#\"&S$1,'[1]Pt1-DATA'!$C:$C,0),0)","v":0},{"$f":"IFERROR(MATCH($A173&\"#\"&T$1,'[1]Pt1-DATA'!$C:$C,0),0)","v":0}]
[615,"Helicopter","Transport & Utility","Kopter","Leonardo Kopter","Safran Arriel 2K","rotocraft civil",null,false,null,{"$f":"IFERROR(MATCH($A174&\"#\"&K$1,'[1]Pt1-DATA'!$C:$C,0),0)","v":0},null,{"$f":"IFERROR(MATCH($A174&\"#\"&M$1,'[1]Pt1-DATA'!$C:$C,0),0)","v":0},{"$f":"IFERROR(MATCH($A174&\"#\"&N$1,'[1]Pt1-DATA'!$C:$C,0),0)","v":0},{"$f":"IFERROR(MATCH($A174&\"#\"&O$1,'[1]Pt1-DATA'!$C:$C,0),0)","v":0},{"$f":"IFERROR(MATCH($A174&\"#\"&P$1,'[1]Pt1-DATA'!$C:$C,0),0)","v":0},{"$f":"IFERROR(MATCH($A174&\"#\"&Q$1,'[1]Pt1-DATA'!$C:$C,0),0)","v":0},{"$f":"IFERROR(MATCH($A174&\"#\"&R$1,'[1]Pt1-DATA'!$C:$C,0),0)","v":0},{"$f":"IFERROR(MATCH($A174&\"#\"&S$1,'[1]Pt1-DATA'!$C:$C,0),0)","v":0},{"$f":"IFERROR(MATCH($A174&\"#\"&T$1,'[1]Pt1-DATA'!$C:$C,0),0)","v":0}]
[103,"Helicopter","Transport & Utility","Leonardo AW101","Leonardo AW101","Safran RTM322","rotocraft civil",null,false,null,{"$f":"IFERROR(MATCH($A175&\"#\"&K$1,'[1]Pt1-DATA'!$C:$C,0),0)","v":0},null,{"$f":"IFERROR(MATCH($A175&\"#\"&M$1,'[1]Pt1-DATA'!$C:$C,0),0)","v":0},{"$f":"IFERROR(MATCH($A175&\"#\"&N$1,'[1]Pt1-DATA'!$C:$C,0),0)","v":0},{"$f":"IFERROR(MATCH($A175&\"#\"&O$1,'[1]Pt1-DATA'!$C:$C,0),0)","v":0},{"$f":"IFERROR(MATCH($A175&\"#\"&P$1,'[1]Pt1-DATA'!$C:$C,0),0)","v":0},{"$f":"IFERROR(MATCH($A175&\"#\"&Q$1,'[1]Pt1-DATA'!$C:$C,0),0)","v":0},{"$f":"IFERROR(MATCH($A175&\"#\"&R$1,'[1]Pt1-DATA'!$C:$C,0),0)","v":0},{"$f":"IFERROR(MATCH($A175&\"#\"&S$1,'[1]Pt1-DATA'!$C:$C,0),0)","v":0},{"$f":"IFERROR(MATCH($A175&\"#\"&T$1,'[1]Pt1-DATA'!$C:$C,0),0)","v":0}]
[455,"Helicopter","Transport & Utility","Leonardo AW109","Leonardo AW109","Pratt & Whitney Canada PW206","rotocraft civil",null,false,null,{"$f":"IFERROR(MATCH($A176&\"#\"&K$1,'[1]Pt1-DATA'!$C:$C,0),0)","v":0},null,{"$f":"IFERROR(MATCH($A176&\"#\"&M$1,'[1]Pt1-DATA'!$C:$C,0),0)","v":0},{"$f":"IFERROR(MATCH($A176&\"#\"&N$1,'[1]Pt1-DATA'!$C:$C,0),0)","v":0},{"$f":"IFERROR(MATCH($A176&\"#\"&O$1,'[1]Pt1-DATA'!$C:$C,0),0)","v":0},{"$f":"IFERROR(MATCH($A176&\"#\"&P$1,'[1]Pt1-DATA'!$C:$C,0),0)","v":0},{"$f":"IFERROR(MATCH($A176&\"#\"&Q$1,'[1]Pt1-DATA'!$C:$C,0),0)","v":0},{"$f":"IFERROR(MATCH($A176&\"#\"&R$1,'[1]Pt1-DATA'!$C:$C,0),0)","v":0},{"$f":"IFERROR(MATCH($A176&\"#\"&S$1,'[1]Pt1-DATA'!$C:$C,0),0)","v":0},{"$f":"IFERROR(MATCH($A176&\"#\"&T$1,'[1]Pt1-DATA'!$C:$C,0),0)","v":0}]
[83,"Helicopter","Transport & Utility","Leonardo AW109","Leonardo AW109","Turbomeca Arrius","rotocraft civil",null,false,null,{"$f":"IFERROR(MATCH($A177&\"#\"&K$1,'[1]Pt1-DATA'!$C:$C,0),0)","v":0},null,{"$f":"IFERROR(MATCH($A177&\"#\"&M$1,'[1]Pt1-DATA'!$C:$C,0),0)","v":0},{"$f":"IFERROR(MATCH($A177&\"#\"&N$1,'[1]Pt1-DATA'!$C:$C,0),0)","v":0},{"$f":"IFERROR(MATCH($A177&\"#\"&O$1,'[1]Pt1-DATA'!$C:$C,0),0)","v":0},{"$f":"IFERROR(MATCH($A177&\"#\"&P$1,'[1]Pt1-DATA'!$C:$C,0),0)","v":0},{"$f":"IFERROR(MATCH($A177&\"#\"&Q$1,'[1]Pt1-DATA'!$C:$C,0),0)","v":0},{"$f":"IFERROR(MATCH($A177&\"#\"&R$1,'[1]Pt1-DATA'!$C:$C,0),0)","v":0},{"$f":"IFERROR(MATCH($A177&\"#\"&S$1,'[1]Pt1-DATA'!$C:$C,0),0)","v":0},{"$f":"IFERROR(MATCH($A177&\"#\"&T$1,'[1]Pt1-DATA'!$C:$C,0),0)","v":0}]
[84,"Helicopter","Transport & Utility","Leonardo AW119 Koala","Leonardo AW119 Koala","Pratt & Whitney Canada PT6B","rotocraft civil",null,false,null,{"$f":"IFERROR(MATCH($A178&\"#\"&K$1,'[1]Pt1-DATA'!$C:$C,0),0)","v":0},null,{"$f":"IFERROR(MATCH($A178&\"#\"&M$1,'[1]Pt1-DATA'!$C:$C,0),0)","v":0},{"$f":"IFERROR(MATCH($A178&\"#\"&N$1,'[1]Pt1-DATA'!$C:$C,0),0)","v":0},{"$f":"IFERROR(MATCH($A178&\"#\"&O$1,'[1]Pt1-DATA'!$C:$C,0),0)","v":0},{"$f":"IFERROR(MATCH($A178&\"#\"&P$1,'[1]Pt1-DATA'!$C:$C,0),0)","v":0},{"$f":"IFERROR(MATCH($A178&\"#\"&Q$1,'[1]Pt1-DATA'!$C:$C,0),0)","v":0},{"$f":"IFERROR(MATCH($A178&\"#\"&R$1,'[1]Pt1-DATA'!$C:$C,0),0)","v":0},{"$f":"IFERROR(MATCH($A178&\"#\"&S$1,'[1]Pt1-DATA'!$C:$C,0),0)","v":0},{"$f":"IFERROR(MATCH($A178&\"#\"&T$1,'[1]Pt1-DATA'!$C:$C,0),0)","v":0}]
[86,"Helicopter","Transport & Utility","Leonardo AW139","Leonardo AW139","Pratt & Whitney Canada PT6C","rotocraft civil",null,false,null,{"$f":"IFERROR(MATCH($A179&\"#\"&K$1,'[1]Pt1-DATA'!$C:$C,0),0)","v":0},null,{"$f":"IFERROR(MATCH($A179&\"#\"&M$1,'[1]Pt1-DATA'!$C:$C,0),0)","v":0},{"$f":"IFERROR(MATCH($A179&\"#\"&N$1,'[1]Pt1-DATA'!$C:$C,0),0)","v":0},{"$f":"IFERROR(MATCH($A179&\"#\"&O$1,'[1]Pt1-DATA'!$C:$C,0),0)","v":0},{"$f":"IFERROR(MATCH($A179&\"#\"&P$1,'[1]Pt1-DATA'!$C:$C,0),0)","v":0},{"$f":"IFERROR(MATCH($A179&\"#\"&Q$1,'[1]Pt1-DATA'!$C:$C,0),0)","v":0},{"$f":"IFERROR(MATCH($A179&\"#\"&R$1,'[1]Pt1-DATA'!$C:$C,0),0)","v":0},{"$f":"IFERROR(MATCH($A179&\"#\"&S$1,'[1]Pt1-DATA'!$C:$C,0),0)","v":0},{"$f":"IFERROR(MATCH($A179&\"#\"&T$1,'[1]Pt1-DATA'!$C:$C,0),0)","v":0}]
[134,"Helicopter","Transport & Utility","Leonardo AW159 Lynx","Leonardo AW159 Lynx","LHTEC T800","rotocraft civil",null,false,null,{"$f":"IFERROR(MATCH($A180&\"#\"&K$1,'[1]Pt1-DATA'!$C:$C,0),0)","v":0},null,{"$f":"IFERROR(MATCH($A180&\"#\"&M$1,'[1]Pt1-DATA'!$C:$C,0),0)","v":0},{"$f":"IFERROR(MATCH($A180&\"#\"&N$1,'[1]Pt1-DATA'!$C:$C,0),0)","v":0},{"$f":"IFERROR(MATCH($A180&\"#\"&O$1,'[1]Pt1-DATA'!$C:$C,0),0)","v":0},{"$f":"IFERROR(MATCH($A180&\"#\"&P$1,'[1]Pt1-DATA'!$C:$C,0),0)","v":0},{"$f":"IFERROR(MATCH($A180&\"#\"&Q$1,'[1]Pt1-DATA'!$C:$C,0),0)","v":0},{"$f":"IFERROR(MATCH($A180&\"#\"&R$1,'[1]Pt1-DATA'!$C:$C,0),0)","v":0},{"$f":"IFERROR(MATCH($A180&\"#\"&S$1,'[1]Pt1-DATA'!$C:$C,0),0)","v":0},{"$f":"IFERROR(MATCH($A180&\"#\"&T$1,'[1]Pt1-DATA'!$C:$C,0),0)","v":0}]
[88,"Helicopter","Transport & Utility","Leonardo AW169","Leonardo AW169","Pratt & Whitney Canada PW210","rotocraft civil",null,false,null,{"$f":"IFERROR(MATCH($A181&\"#\"&K$1,'[1]Pt1-DATA'!$C:$C,0),0)","v":0},null,{"$f":"IFERROR(MATCH($A181&\"#\"&M$1,'[1]Pt1-DATA'!$C:$C,0),0)","v":0},{"$f":"IFERROR(MATCH($A181&\"#\"&N$1,'[1]Pt1-DATA'!$C:$C,0),0)","v":0},{"$f":"IFERROR(MATCH($A181&\"#\"&O$1,'[1]Pt1-DATA'!$C:$C,0),0)","v":0},{"$f":"IFERROR(MATCH($A181&\"#\"&P$1,'[1]Pt1-DATA'!$C:$C,0),0)","v":0},{"$f":"IFERROR(MATCH($A181&\"#\"&Q$1,'[1]Pt1-DATA'!$C:$C,0),0)","v":0},{"$f":"IFERROR(MATCH($A181&\"#\"&R$1,'[1]Pt1-DATA'!$C:$C,0),0)","v":0},{"$f":"IFERROR(MATCH($A181&\"#\"&S$1,'[1]Pt1-DATA'!$C:$C,0),0)","v":0},{"$f":"IFERROR(MATCH($A181&\"#\"&T$1,'[1]Pt1-DATA'!$C:$C,0),0)","v":0}]
[87,"Helicopter","Transport & Utility","Leonardo AW189","Leonardo AW189","General Electric T700","rotocraft civil",null,false,null,{"$f":"IFERROR(MATCH($A182&\"#\"&K$1,'[1]Pt1-DATA'!$C:$C,0),0)","v":0},null,{"$f":"IFERROR(MATCH($A182&\"#\"&M$1,'[1]Pt1-DATA'!$C:$C,0),0)","v":0},{"$f":"IFERROR(MATCH($A182&\"#\"&N$1,'[1]Pt1-DATA'!$C:$C,0),0)","v":0},{"$f":"IFERROR(MATCH($A182&\"#\"&O$1,'[1]Pt1-DATA'!$C:$C,0),0)","v":0},{"$f":"IFERROR(MATCH($A182&\"#\"&P$1,'[1]Pt1-DATA'!$C:$C,0),0)","v":0},{"$f":"IFERROR(MATCH($A182&\"#\"&Q$1,'[1]Pt1-DATA'!$C:$C,0),0)","v":0},{"$f":"IFERROR(MATCH($A182&\"#\"&R$1,'[1]Pt1-DATA'!$C:$C,0),0)","v":0},{"$f":"IFERROR(MATCH($A182&\"#\"&S$1,'[1]Pt1-DATA'!$C:$C,0),0)","v":0},{"$f":"IFERROR(MATCH($A182&\"#\"&T$1,'[1]Pt1-DATA'!$C:$C,0),0)","v":0}]
[96,"Helicopter","Transport & Utility","Leonardo AW609","Leonardo AW609","Pratt & Whitney Canada PT6C","rotocraft civil",null,false,null,{"$f":"IFERROR(MATCH($A183&\"#\"&K$1,'[1]Pt1-DATA'!$C:$C,0),0)","v":0},null,{"$f":"IFERROR(MATCH($A183&\"#\"&M$1,'[1]Pt1-DATA'!$C:$C,0),0)","v":0},{"$f":"IFERROR(MATCH($A183&\"#\"&N$1,'[1]Pt1-DATA'!$C:$C,0),0)","v":0},{"$f":"IFERROR(MATCH($A183&\"#\"&O$1,'[1]Pt1-DATA'!$C:$C,0),0)","v":0},{"$f":"IFERROR(MATCH($A183&\"#\"&P$1,'[1]Pt1-DATA'!$C:$C,0),0)","v":0},{"$f":"IFERROR(MATCH($A183&\"#\"&Q$1,'[1]Pt1-DATA'!$C:$C,0),0)","v":0},{"$f":"IFERROR(MATCH($A183&\"#\"&R$1,'[1]Pt1-DATA'!$C:$C,0),0)","v":0},{"$f":"IFERROR(MATCH($A183&\"#\"&S$1,'[1]Pt1-DATA'!$C:$C,0),0)","v":0},{"$f":"IFERROR(MATCH($A183&\"#\"&T$1,'[1]Pt1-DATA'!$C:$C,0),0)","v":0}]
[120,"Helicopter","Transport & Utility","MD 500/600","MD Helicopters MD 500/600","Allison Model 250 (C)","rotocraft civil",null,false,null,{"$f":"IFERROR(MATCH($A184&\"#\"&K$1,'[1]Pt1-DATA'!$C:$C,0),0)","v":0},null,{"$f":"IFERROR(MATCH($A184&\"#\"&M$1,'[1]Pt1-DATA'!$C:$C,0),0)","v":0},{"$f":"IFERROR(MATCH($A184&\"#\"&N$1,'[1]Pt1-DATA'!$C:$C,0),0)","v":0},{"$f":"IFERROR(MATCH($A184&\"#\"&O$1,'[1]Pt1-DATA'!$C:$C,0),0)","v":0},{"$f":"IFERROR(MATCH($A184&\"#\"&P$1,'[1]Pt1-DATA'!$C:$C,0),0)","v":0},{"$f":"IFERROR(MATCH($A184&\"#\"&Q$1,'[1]Pt1-DATA'!$C:$C,0),0)","v":0},{"$f":"IFERROR(MATCH($A184&\"#\"&R$1,'[1]Pt1-DATA'!$C:$C,0),0)","v":0},{"$f":"IFERROR(MATCH($A184&\"#\"&S$1,'[1]Pt1-DATA'!$C:$C,0),0)","v":0},{"$f":"IFERROR(MATCH($A184&\"#\"&T$1,'[1]Pt1-DATA'!$C:$C,0),0)","v":0}]
[119,"Helicopter","Transport & Utility","MD Explorer","MD Helicopters MD Explorer","Pratt & Whitney Canada PW210","rotocraft civil",null,false,null,{"$f":"IFERROR(MATCH($A185&\"#\"&K$1,'[1]Pt1-DATA'!$C:$C,0),0)","v":0},null,{"$f":"IFERROR(MATCH($A185&\"#\"&M$1,'[1]Pt1-DATA'!$C:$C,0),0)","v":0},{"$f":"IFERROR(MATCH($A185&\"#\"&N$1,'[1]Pt1-DATA'!$C:$C,0),0)","v":0},{"$f":"IFERROR(MATCH($A185&\"#\"&O$1,'[1]Pt1-DATA'!$C:$C,0),0)","v":0},{"$f":"IFERROR(MATCH($A185&\"#\"&P$1,'[1]Pt1-DATA'!$C:$C,0),0)","v":0},{"$f":"IFERROR(MATCH($A185&\"#\"&Q$1,'[1]Pt1-DATA'!$C:$C,0),0)","v":0},{"$f":"IFERROR(MATCH($A185&\"#\"&R$1,'[1]Pt1-DATA'!$C:$C,0),0)","v":0},{"$f":"IFERROR(MATCH($A185&\"#\"&S$1,'[1]Pt1-DATA'!$C:$C,0),0)","v":0},{"$f":"IFERROR(MATCH($A185&\"#\"&T$1,'[1]Pt1-DATA'!$C:$C,0),0)","v":0}]
[582,"Helicopter","Transport & Utility","MH139","Boeing/Leonardo MH139","Pratt & Whitney Canada PT6T","rotocraft civil",null,false,null,{"$f":"IFERROR(MATCH($A186&\"#\"&K$1,'[1]Pt1-DATA'!$C:$C,0),0)","v":0},null,{"$f":"IFERROR(MATCH($A186&\"#\"&M$1,'[1]Pt1-DATA'!$C:$C,0),0)","v":0},{"$f":"IFERROR(MATCH($A186&\"#\"&N$1,'[1]Pt1-DATA'!$C:$C,0),0)","v":0},{"$f":"IFERROR(MATCH($A186&\"#\"&O$1,'[1]Pt1-DATA'!$C:$C,0),0)","v":0},{"$f":"IFERROR(MATCH($A186&\"#\"&P$1,'[1]Pt1-DATA'!$C:$C,0),0)","v":0},{"$f":"IFERROR(MATCH($A186&\"#\"&Q$1,'[1]Pt1-DATA'!$C:$C,0),0)","v":0},{"$f":"IFERROR(MATCH($A186&\"#\"&R$1,'[1]Pt1-DATA'!$C:$C,0),0)","v":0},{"$f":"IFERROR(MATCH($A186&\"#\"&S$1,'[1]Pt1-DATA'!$C:$C,0),0)","v":0},{"$f":"IFERROR(MATCH($A186&\"#\"&T$1,'[1]Pt1-DATA'!$C:$C,0),0)","v":0}]
[122,"Helicopter","Transport & Utility","NH90","NHIndustries NATO Frigate Helicopter","Safran RTM322","rotorcraft mil",null,false,null,{"$f":"IFERROR(MATCH($A187&\"#\"&K$1,'[1]Pt1-DATA'!$C:$C,0),0)","v":0},null,{"$f":"IFERROR(MATCH($A187&\"#\"&M$1,'[1]Pt1-DATA'!$C:$C,0),0)","v":0},{"$f":"IFERROR(MATCH($A187&\"#\"&N$1,'[1]Pt1-DATA'!$C:$C,0),0)","v":0},{"$f":"IFERROR(MATCH($A187&\"#\"&O$1,'[1]Pt1-DATA'!$C:$C,0),0)","v":0},{"$f":"IFERROR(MATCH($A187&\"#\"&P$1,'[1]Pt1-DATA'!$C:$C,0),0)","v":0},{"$f":"IFERROR(MATCH($A187&\"#\"&Q$1,'[1]Pt1-DATA'!$C:$C,0),0)","v":0},{"$f":"IFERROR(MATCH($A187&\"#\"&R$1,'[1]Pt1-DATA'!$C:$C,0),0)","v":0},{"$f":"IFERROR(MATCH($A187&\"#\"&S$1,'[1]Pt1-DATA'!$C:$C,0),0)","v":0},{"$f":"IFERROR(MATCH($A187&\"#\"&T$1,'[1]Pt1-DATA'!$C:$C,0),0)","v":0}]
[638,"Helicopter","Transport & Utility","NH90","NHIndustries Tactical Transport Helicopter","General Electric T700","rotorcraft mil",null,false,null,{"$f":"IFERROR(MATCH($A188&\"#\"&K$1,'[1]Pt1-DATA'!$C:$C,0),0)","v":0},null,{"$f":"IFERROR(MATCH($A188&\"#\"&M$1,'[1]Pt1-DATA'!$C:$C,0),0)","v":0},{"$f":"IFERROR(MATCH($A188&\"#\"&N$1,'[1]Pt1-DATA'!$C:$C,0),0)","v":0},{"$f":"IFERROR(MATCH($A188&\"#\"&O$1,'[1]Pt1-DATA'!$C:$C,0),0)","v":0},{"$f":"IFERROR(MATCH($A188&\"#\"&P$1,'[1]Pt1-DATA'!$C:$C,0),0)","v":0},{"$f":"IFERROR(MATCH($A188&\"#\"&Q$1,'[1]Pt1-DATA'!$C:$C,0),0)","v":0},{"$f":"IFERROR(MATCH($A188&\"#\"&R$1,'[1]Pt1-DATA'!$C:$C,0),0)","v":0},{"$f":"IFERROR(MATCH($A188&\"#\"&S$1,'[1]Pt1-DATA'!$C:$C,0),0)","v":0},{"$f":"IFERROR(MATCH($A188&\"#\"&T$1,'[1]Pt1-DATA'!$C:$C,0),0)","v":0}]
[123,"Helicopter","Transport & Utility","NH90","NHIndustries Tactical Transport Helicopter","Safran RTM322","rotorcraft mil",null,false,null,{"$f":"IFERROR(MATCH($A189&\"#\"&K$1,'[1]Pt1-DATA'!$C:$C,0),0)","v":0},null,{"$f":"IFERROR(MATCH($A189&\"#\"&M$1,'[1]Pt1-DATA'!$C:$C,0),0)","v":0},{"$f":"IFERROR(MATCH($A189&\"#\"&N$1,'[1]Pt1-DATA'!$C:$C,0),0)","v":0},{"$f":"IFERROR(MATCH($A189&\"#\"&O$1,'[1]Pt1-DATA'!$C:$C,0),0)","v":0},{"$f":"IFERROR(MATCH($A189&\"#\"&P$1,'[1]Pt1-DATA'!$C:$C,0),0)","v":0},{"$f":"IFERROR(MATCH($A189&\"#\"&Q$1,'[1]Pt1-DATA'!$C:$C,0),0)","v":0},{"$f":"IFERROR(MATCH($A189&\"#\"&R$1,'[1]Pt1-DATA'!$C:$C,0),0)","v":0},{"$f":"IFERROR(MATCH($A189&\"#\"&S$1,'[1]Pt1-DATA'!$C:$C,0),0)","v":0},{"$f":"IFERROR(MATCH($A189&\"#\"&T$1,'[1]Pt1-DATA'!$C:$C,0),0)","v":0}]
[182,"Helicopter","Transport & Utility","OH-58","Bell OH-58D Kiowa","Allison Model 250 (C)","rotorcraft mil",null,false,null,{"$f":"IFERROR(MATCH($A190&\"#\"&K$1,'[1]Pt1-DATA'!$C:$C,0),0)","v":0},null,{"$f":"IFERROR(MATCH($A190&\"#\"&M$1,'[1]Pt1-DATA'!$C:$C,0),0)","v":0},{"$f":"IFERROR(MATCH($A190&\"#\"&N$1,'[1]Pt1-DATA'!$C:$C,0),0)","v":0},{"$f":"IFERROR(MATCH($A190&\"#\"&O$1,'[1]Pt1-DATA'!$C:$C,0),0)","v":0},{"$f":"IFERROR(MATCH($A190&\"#\"&P$1,'[1]Pt1-DATA'!$C:$C,0),0)","v":0},{"$f":"IFERROR(MATCH($A190&\"#\"&Q$1,'[1]Pt1-DATA'!$C:$C,0),0)","v":0},{"$f":"IFERROR(MATCH($A190&\"#\"&R$1,'[1]Pt1-DATA'!$C:$C,0),0)","v":0},{"$f":"IFERROR(MATCH($A190&\"#\"&S$1,'[1]Pt1-DATA'!$C:$C,0),0)","v":0},{"$f":"IFERROR(MATCH($A190&\"#\"&T$1,'[1]Pt1-DATA'!$C:$C,0),0)","v":0}]
[124,"Helicopter","Transport & Utility","R66","Robinson R66","Rolls-Royce RR300","rotocraft civil",null,false,null,{"$f":"IFERROR(MATCH($A191&\"#\"&K$1,'[1]Pt1-DATA'!$C:$C,0),0)","v":0},null,{"$f":"IFERROR(MATCH($A191&\"#\"&M$1,'[1]Pt1-DATA'!$C:$C,0),0)","v":0},{"$f":"IFERROR(MATCH($A191&\"#\"&N$1,'[1]Pt1-DATA'!$C:$C,0),0)","v":0},{"$f":"IFERROR(MATCH($A191&\"#\"&O$1,'[1]Pt1-DATA'!$C:$C,0),0)","v":0},{"$f":"IFERROR(MATCH($A191&\"#\"&P$1,'[1]Pt1-DATA'!$C:$C,0),0)","v":0},{"$f":"IFERROR(MATCH($A191&\"#\"&Q$1,'[1]Pt1-DATA'!$C:$C,0),0)","v":0},{"$f":"IFERROR(MATCH($A191&\"#\"&R$1,'[1]Pt1-DATA'!$C:$C,0),0)","v":0},{"$f":"IFERROR(MATCH($A191&\"#\"&S$1,'[1]Pt1-DATA'!$C:$C,0),0)","v":0},{"$f":"IFERROR(MATCH($A191&\"#\"&T$1,'[1]Pt1-DATA'!$C:$C,0),0)","v":0}]
[125,"Helicopter","Transport & Utility","S-76","Sikorsky S-76","Pratt & Whitney Canada PW210","rotocraft civil",null,false,null,{"$f":"IFERROR(MATCH($A192&\"#\"&K$1,'[1]Pt1-DATA'!$C:$C,0),0)","v":0},null,{"$f":"IFERROR(MATCH($A192&\"#\"&M$1,'[1]Pt1-DATA'!$C:$C,0),0)","v":0},{"$f":"IFERROR(MATCH($A192&\"#\"&N$1,'[1]Pt1-DATA'!$C:$C,0),0)","v":0},{"$f":"IFERROR(MATCH($A192&\"#\"&O$1,'[1]Pt1-DATA'!$C:$C,0),0)","v":0},{"$f":"IFERROR(MATCH($A192&\"#\"&P$1,'[1]Pt1-DATA'!$C:$C,0),0)","v":0},{"$f":"IFERROR(MATCH($A192&\"#\"&Q$1,'[1]Pt1-DATA'!$C:$C,0),0)","v":0},{"$f":"IFERROR(MATCH($A192&\"#\"&R$1,'[1]Pt1-DATA'!$C:$C,0),0)","v":0},{"$f":"IFERROR(MATCH($A192&\"#\"&S$1,'[1]Pt1-DATA'!$C:$C,0),0)","v":0},{"$f":"IFERROR(MATCH($A192&\"#\"&T$1,'[1]Pt1-DATA'!$C:$C,0),0)","v":0}]
[126,"Helicopter","Transport & Utility","S-92","Sikorsky S-92","General Electric T700","rotocraft civil",null,false,null,{"$f":"IFERROR(MATCH($A193&\"#\"&K$1,'[1]Pt1-DATA'!$C:$C,0),0)","v":0},null,{"$f":"IFERROR(MATCH($A193&\"#\"&M$1,'[1]Pt1-DATA'!$C:$C,0),0)","v":0},{"$f":"IFERROR(MATCH($A193&\"#\"&N$1,'[1]Pt1-DATA'!$C:$C,0),0)","v":0},{"$f":"IFERROR(MATCH($A193&\"#\"&O$1,'[1]Pt1-DATA'!$C:$C,0),0)","v":0},{"$f":"IFERROR(MATCH($A193&\"#\"&P$1,'[1]Pt1-DATA'!$C:$C,0),0)","v":0},{"$f":"IFERROR(MATCH($A193&\"#\"&Q$1,'[1]Pt1-DATA'!$C:$C,0),0)","v":0},{"$f":"IFERROR(MATCH($A193&\"#\"&R$1,'[1]Pt1-DATA'!$C:$C,0),0)","v":0},{"$f":"IFERROR(MATCH($A193&\"#\"&S$1,'[1]Pt1-DATA'!$C:$C,0),0)","v":0},{"$f":"IFERROR(MATCH($A193&\"#\"&T$1,'[1]Pt1-DATA'!$C:$C,0),0)","v":0}]
[129,"Helicopter","Transport & Utility","SH-60","Sikorsky SH-60 Seahawk - MH-60R","General Electric T700","rotorcraft mil",null,false,null,{"$f":"IFERROR(MATCH($A194&\"#\"&K$1,'[1]Pt1-DATA'!$C:$C,0),0)","v":0},null,{"$f":"IFERROR(MATCH($A194&\"#\"&M$1,'[1]Pt1-DATA'!$C:$C,0),0)","v":0},{"$f":"IFERROR(MATCH($A194&\"#\"&N$1,'[1]Pt1-DATA'!$C:$C,0),0)","v":0},{"$f":"IFERROR(MATCH($A194&\"#\"&O$1,'[1]Pt1-DATA'!$C:$C,0),0)","v":0},{"$f":"IFERROR(MATCH($A194&\"#\"&P$1,'[1]Pt1-DATA'!$C:$C,0),0)","v":0},{"$f":"IFERROR(MATCH($A194&\"#\"&Q$1,'[1]Pt1-DATA'!$C:$C,0),0)","v":0},{"$f":"IFERROR(MATCH($A194&\"#\"&R$1,'[1]Pt1-DATA'!$C:$C,0),0)","v":0},{"$f":"IFERROR(MATCH($A194&\"#\"&S$1,'[1]Pt1-DATA'!$C:$C,0),0)","v":0},{"$f":"IFERROR(MATCH($A194&\"#\"&T$1,'[1]Pt1-DATA'!$C:$C,0),0)","v":0}]
[130,"Helicopter","Transport & Utility","SH-60","Sikorsky SH-60 Seahawk - MH-60S","General Electric T700","rotorcraft mil",null,{"$f":"SUM(K195:T195)>0","v":false},null,{"$f":"IFERROR(MATCH($A195&\"#\"&K$1,'[1]Pt1-DATA'!$C:$C,0),0)","v":0},null,{"$f":"IFERROR(MATCH($A195&\"#\"&M$1,'[1]Pt1-DATA'!$C:$C,0),0)","v":0},{"$f":"IFERROR(MATCH($A195&\"#\"&N$1,'[1]Pt1-DATA'!$C:$C,0),0)","v":0},{"$f":"IFERROR(MATCH($A195&\"#\"&O$1,'[1]Pt1-DATA'!$C:$C,0),0)","v":0},{"$f":"IFERROR(MATCH($A195&\"#\"&P$1,'[1]Pt1-DATA'!$C:$C,0),0)","v":0},{"$f":"IFERROR(MATCH($A195&\"#\"&Q$1,'[1]Pt1-DATA'!$C:$C,0),0)","v":0},{"$f":"IFERROR(MATCH($A195&\"#\"&R$1,'[1]Pt1-DATA'!$C:$C,0),0)","v":0},{"$f":"IFERROR(MATCH($A195&\"#\"&S$1,'[1]Pt1-DATA'!$C:$C,0),0)","v":0},{"$f":"IFERROR(MATCH($A195&\"#\"&T$1,'[1]Pt1-DATA'!$C:$C,0),0)","v":0}]
[128,"Helicopter","Transport & Utility","SH-60","Sikorsky SH-60 Seahawk - SH-60B Seahawk","General Electric T700","rotorcraft mil",null,false,null,{"$f":"IFERROR(MATCH($A196&\"#\"&K$1,'[1]Pt1-DATA'!$C:$C,0),0)","v":0},null,{"$f":"IFERROR(MATCH($A196&\"#\"&M$1,'[1]Pt1-DATA'!$C:$C,0),0)","v":0},{"$f":"IFERROR(MATCH($A196&\"#\"&N$1,'[1]Pt1-DATA'!$C:$C,0),0)","v":0},{"$f":"IFERROR(MATCH($A196&\"#\"&O$1,'[1]Pt1-DATA'!$C:$C,0),0)","v":0},{"$f":"IFERROR(MATCH($A196&\"#\"&P$1,'[1]Pt1-DATA'!$C:$C,0),0)","v":0},{"$f":"IFERROR(MATCH($A196&\"#\"&Q$1,'[1]Pt1-DATA'!$C:$C,0),0)","v":0},{"$f":"IFERROR(MATCH($A196&\"#\"&R$1,'[1]Pt1-DATA'!$C:$C,0),0)","v":0},{"$f":"IFERROR(MATCH($A196&\"#\"&S$1,'[1]Pt1-DATA'!$C:$C,0),0)","v":0},{"$f":"IFERROR(MATCH($A196&\"#\"&T$1,'[1]Pt1-DATA'!$C:$C,0),0)","v":0}]
[127,"Helicopter","Transport & Utility","Sikorsky CH-53K King Stallion","Sikorsky CH-53K King Stallion","General Electric GE38","rotorcraft mil",null,false,null,{"$f":"IFERROR(MATCH($A197&\"#\"&K$1,'[1]Pt1-DATA'!$C:$C,0),0)","v":0},null,{"$f":"IFERROR(MATCH($A197&\"#\"&M$1,'[1]Pt1-DATA'!$C:$C,0),0)","v":0},{"$f":"IFERROR(MATCH($A197&\"#\"&N$1,'[1]Pt1-DATA'!$C:$C,0),0)","v":0},{"$f":"IFERROR(MATCH($A197&\"#\"&O$1,'[1]Pt1-DATA'!$C:$C,0),0)","v":0},{"$f":"IFERROR(MATCH($A197&\"#\"&P$1,'[1]Pt1-DATA'!$C:$C,0),0)","v":0},{"$f":"IFERROR(MATCH($A197&\"#\"&Q$1,'[1]Pt1-DATA'!$C:$C,0),0)","v":0},{"$f":"IFERROR(MATCH($A197&\"#\"&R$1,'[1]Pt1-DATA'!$C:$C,0),0)","v":0},{"$f":"IFERROR(MATCH($A197&\"#\"&S$1,'[1]Pt1-DATA'!$C:$C,0),0)","v":0},{"$f":"IFERROR(MATCH($A197&\"#\"&T$1,'[1]Pt1-DATA'!$C:$C,0),0)","v":0}]
[138,"Helicopter","Transport & Utility","TAI T625","TAI T625","LHTEC T800","rotorcraft mil",null,false,null,{"$f":"IFERROR(MATCH($A198&\"#\"&K$1,'[1]Pt1-DATA'!$C:$C,0),0)","v":0},null,{"$f":"IFERROR(MATCH($A198&\"#\"&M$1,'[1]Pt1-DATA'!$C:$C,0),0)","v":0},{"$f":"IFERROR(MATCH($A198&\"#\"&N$1,'[1]Pt1-DATA'!$C:$C,0),0)","v":0},{"$f":"IFERROR(MATCH($A198&\"#\"&O$1,'[1]Pt1-DATA'!$C:$C,0),0)","v":0},{"$f":"IFERROR(MATCH($A198&\"#\"&P$1,'[1]Pt1-DATA'!$C:$C,0),0)","v":0},{"$f":"IFERROR(MATCH($A198&\"#\"&Q$1,'[1]Pt1-DATA'!$C:$C,0),0)","v":0},{"$f":"IFERROR(MATCH($A198&\"#\"&R$1,'[1]Pt1-DATA'!$C:$C,0),0)","v":0},{"$f":"IFERROR(MATCH($A198&\"#\"&S$1,'[1]Pt1-DATA'!$C:$C,0),0)","v":0},{"$f":"IFERROR(MATCH($A198&\"#\"&T$1,'[1]Pt1-DATA'!$C:$C,0),0)","v":0}]
[94,"Helicopter","Transport & Utility","UH-1","Bell UH-1 Iroquois/412","Pratt & Whitney Canada PT6T","rotorcraft mil",null,false,null,{"$f":"IFERROR(MATCH($A199&\"#\"&K$1,'[1]Pt1-DATA'!$C:$C,0),0)","v":0},null,{"$f":"IFERROR(MATCH($A199&\"#\"&M$1,'[1]Pt1-DATA'!$C:$C,0),0)","v":0},{"$f":"IFERROR(MATCH($A199&\"#\"&N$1,'[1]Pt1-DATA'!$C:$C,0),0)","v":0},{"$f":"IFERROR(MATCH($A199&\"#\"&O$1,'[1]Pt1-DATA'!$C:$C,0),0)","v":0},{"$f":"IFERROR(MATCH($A199&\"#\"&P$1,'[1]Pt1-DATA'!$C:$C,0),0)","v":0},{"$f":"IFERROR(MATCH($A199&\"#\"&Q$1,'[1]Pt1-DATA'!$C:$C,0),0)","v":0},{"$f":"IFERROR(MATCH($A199&\"#\"&R$1,'[1]Pt1-DATA'!$C:$C,0),0)","v":0},{"$f":"IFERROR(MATCH($A199&\"#\"&S$1,'[1]Pt1-DATA'!$C:$C,0),0)","v":0},{"$f":"IFERROR(MATCH($A199&\"#\"&T$1,'[1]Pt1-DATA'!$C:$C,0),0)","v":0}]
[95,"Helicopter","Transport & Utility","UH-1","Bell UH-1Y Venom","General Electric T700","rotorcraft mil",null,false,null,{"$f":"IFERROR(MATCH($A200&\"#\"&K$1,'[1]Pt1-DATA'!$C:$C,0),0)","v":0},null,{"$f":"IFERROR(MATCH($A200&\"#\"&M$1,'[1]Pt1-DATA'!$C:$C,0),0)","v":0},{"$f":"IFERROR(MATCH($A200&\"#\"&N$1,'[1]Pt1-DATA'!$C:$C,0),0)","v":0},{"$f":"IFERROR(MATCH($A200&\"#\"&O$1,'[1]Pt1-DATA'!$C:$C,0),0)","v":0},{"$f":"IFERROR(MATCH($A200&\"#\"&P$1,'[1]Pt1-DATA'!$C:$C,0),0)","v":0},{"$f":"IFERROR(MATCH($A200&\"#\"&Q$1,'[1]Pt1-DATA'!$C:$C,0),0)","v":0},{"$f":"IFERROR(MATCH($A200&\"#\"&R$1,'[1]Pt1-DATA'!$C:$C,0),0)","v":0},{"$f":"IFERROR(MATCH($A200&\"#\"&S$1,'[1]Pt1-DATA'!$C:$C,0),0)","v":0},{"$f":"IFERROR(MATCH($A200&\"#\"&T$1,'[1]Pt1-DATA'!$C:$C,0),0)","v":0}]
[131,"Helicopter","Transport & Utility","UH-60","Sikorsky UH-60 Black Hawk","General Electric T700","rotorcraft mil",null,false,null,{"$f":"IFERROR(MATCH($A201&\"#\"&K$1,'[1]Pt1-DATA'!$C:$C,0),0)","v":0},null,{"$f":"IFERROR(MATCH($A201&\"#\"&M$1,'[1]Pt1-DATA'!$C:$C,0),0)","v":0},{"$f":"IFERROR(MATCH($A201&\"#\"&N$1,'[1]Pt1-DATA'!$C:$C,0),0)","v":0},{"$f":"IFERROR(MATCH($A201&\"#\"&O$1,'[1]Pt1-DATA'!$C:$C,0),0)","v":0},{"$f":"IFERROR(MATCH($A201&\"#\"&P$1,'[1]Pt1-DATA'!$C:$C,0),0)","v":0},{"$f":"IFERROR(MATCH($A201&\"#\"&Q$1,'[1]Pt1-DATA'!$C:$C,0),0)","v":0},{"$f":"IFERROR(MATCH($A201&\"#\"&R$1,'[1]Pt1-DATA'!$C:$C,0),0)","v":0},{"$f":"IFERROR(MATCH($A201&\"#\"&S$1,'[1]Pt1-DATA'!$C:$C,0),0)","v":0},{"$f":"IFERROR(MATCH($A201&\"#\"&T$1,'[1]Pt1-DATA'!$C:$C,0),0)","v":0}]
[645,"Helicopter","Transport & Utility","X6","Airbus X6","Safran Aneto","rotocraft civil",null,false,null,{"$f":"IFERROR(MATCH($A202&\"#\"&K$1,'[1]Pt1-DATA'!$C:$C,0),0)","v":0},null,{"$f":"IFERROR(MATCH($A202&\"#\"&M$1,'[1]Pt1-DATA'!$C:$C,0),0)","v":0},{"$f":"IFERROR(MATCH($A202&\"#\"&N$1,'[1]Pt1-DATA'!$C:$C,0),0)","v":0},{"$f":"IFERROR(MATCH($A202&\"#\"&O$1,'[1]Pt1-DATA'!$C:$C,0),0)","v":0},{"$f":"IFERROR(MATCH($A202&\"#\"&P$1,'[1]Pt1-DATA'!$C:$C,0),0)","v":0},{"$f":"IFERROR(MATCH($A202&\"#\"&Q$1,'[1]Pt1-DATA'!$C:$C,0),0)","v":0},{"$f":"IFERROR(MATCH($A202&\"#\"&R$1,'[1]Pt1-DATA'!$C:$C,0),0)","v":0},{"$f":"IFERROR(MATCH($A202&\"#\"&S$1,'[1]Pt1-DATA'!$C:$C,0),0)","v":0},{"$f":"IFERROR(MATCH($A202&\"#\"&T$1,'[1]Pt1-DATA'!$C:$C,0),0)","v":0}]
[221,"Large Commercial Aircraft","Single Aisle","A220","Airbus A220-100","Pratt & Whitney PW1500G","Narrow Body",null,true,null,{"$f":"IFERROR(MATCH($A203&\"#\"&K$1,'[1]Pt1-DATA'!$C:$C,0),0)","v":268},null,{"$f":"IFERROR(MATCH($A203&\"#\"&M$1,'[1]Pt1-DATA'!$C:$C,0),0)","v":0},{"$f":"IFERROR(MATCH($A203&\"#\"&N$1,'[1]Pt1-DATA'!$C:$C,0),0)","v":7393},{"$f":"IFERROR(MATCH($A203&\"#\"&O$1,'[1]Pt1-DATA'!$C:$C,0),0)","v":0},{"$f":"IFERROR(MATCH($A203&\"#\"&P$1,'[1]Pt1-DATA'!$C:$C,0),0)","v":0},{"$f":"IFERROR(MATCH($A203&\"#\"&Q$1,'[1]Pt1-DATA'!$C:$C,0),0)","v":0},{"$f":"IFERROR(MATCH($A203&\"#\"&R$1,'[1]Pt1-DATA'!$C:$C,0),0)","v":0},{"$f":"IFERROR(MATCH($A203&\"#\"&S$1,'[1]Pt1-DATA'!$C:$C,0),0)","v":0},{"$f":"IFERROR(MATCH($A203&\"#\"&T$1,'[1]Pt1-DATA'!$C:$C,0),0)","v":0}]
[222,"Large Commercial Aircraft","Single Aisle","A220","Airbus A220-300","Pratt & Whitney PW1500G","Narrow Body",null,true,null,{"$f":"IFERROR(MATCH($A204&\"#\"&K$1,'[1]Pt1-DATA'!$C:$C,0),0)","v":269},null,{"$f":"IFERROR(MATCH($A204&\"#\"&M$1,'[1]Pt1-DATA'!$C:$C,0),0)","v":0},{"$f":"IFERROR(MATCH($A204&\"#\"&N$1,'[1]Pt1-DATA'!$C:$C,0),0)","v":7394},{"$f":"IFERROR(MATCH($A204&\"#\"&O$1,'[1]Pt1-DATA'!$C:$C,0),0)","v":0},{"$f":"IFERROR(MATCH($A204&\"#\"&P$1,'[1]Pt1-DATA'!$C:$C,0),0)","v":0},{"$f":"IFERROR(MATCH($A204&\"#\"&Q$1,'[1]Pt1-DATA'!$C:$C,0),0)","v":0},{"$f":"IFERROR(MATCH($A204&\"#\"&R$1,'[1]Pt1-DATA'!$C:$C,0),0)","v":0},{"$f":"IFERROR(MATCH($A204&\"#\"&S$1,'[1]Pt1-DATA'!$C:$C,0),0)","v":0},{"$f":"IFERROR(MATCH($A204&\"#\"&T$1,'[1]Pt1-DATA'!$C:$C,0),0)","v":0}]
[653,"Large Commercial Aircraft","Single Aisle","A220","Airbus A220-500","Pratt & Whitney PW1500G","Narrow Body",null,true,null,{"$f":"IFERROR(MATCH($A205&\"#\"&K$1,'[1]Pt1-DATA'!$C:$C,0),0)","v":338},null,{"$f":"IFERROR(MATCH($A205&\"#\"&M$1,'[1]Pt1-DATA'!$C:$C,0),0)","v":0},{"$f":"IFERROR(MATCH($A205&\"#\"&N$1,'[1]Pt1-DATA'!$C:$C,0),0)","v":7399},{"$f":"IFERROR(MATCH($A205&\"#\"&O$1,'[1]Pt1-DATA'!$C:$C,0),0)","v":0},{"$f":"IFERROR(MATCH($A205&\"#\"&P$1,'[1]Pt1-DATA'!$C:$C,0),0)","v":0},{"$f":"IFERROR(MATCH($A205&\"#\"&Q$1,'[1]Pt1-DATA'!$C:$C,0),0)","v":0},{"$f":"IFERROR(MATCH($A205&\"#\"&R$1,'[1]Pt1-DATA'!$C:$C,0),0)","v":0},{"$f":"IFERROR(MATCH($A205&\"#\"&S$1,'[1]Pt1-DATA'!$C:$C,0),0)","v":0},{"$f":"IFERROR(MATCH($A205&\"#\"&T$1,'[1]Pt1-DATA'!$C:$C,0),0)","v":0}]
[634,"Large Commercial Aircraft","Single Aisle","A320ceo","A319-100","CFM International CFM56 - CFM56-5A","Narrow Body",null,true,null,{"$f":"IFERROR(MATCH($A206&\"#\"&K$1,'[1]Pt1-DATA'!$C:$C,0),0)","v":270},null,{"$f":"IFERROR(MATCH($A206&\"#\"&M$1,'[1]Pt1-DATA'!$C:$C,0),0)","v":0},{"$f":"IFERROR(MATCH($A206&\"#\"&N$1,'[1]Pt1-DATA'!$C:$C,0),0)","v":0},{"$f":"IFERROR(MATCH($A206&\"#\"&O$1,'[1]Pt1-DATA'!$C:$C,0),0)","v":0},{"$f":"IFERROR(MATCH($A206&\"#\"&P$1,'[1]Pt1-DATA'!$C:$C,0),0)","v":0},{"$f":"IFERROR(MATCH($A206&\"#\"&Q$1,'[1]Pt1-DATA'!$C:$C,0),0)","v":0},{"$f":"IFERROR(MATCH($A206&\"#\"&R$1,'[1]Pt1-DATA'!$C:$C,0),0)","v":0},{"$f":"IFERROR(MATCH($A206&\"#\"&S$1,'[1]Pt1-DATA'!$C:$C,0),0)","v":0},{"$f":"IFERROR(MATCH($A206&\"#\"&T$1,'[1]Pt1-DATA'!$C:$C,0),0)","v":0}]
[633,"Large Commercial Aircraft","Single Aisle","A320ceo","A320-200","CFM International CFM56 - CFM56-5A","Narrow Body",null,true,null,{"$f":"IFERROR(MATCH($A207&\"#\"&K$1,'[1]Pt1-DATA'!$C:$C,0),0)","v":271},null,{"$f":"IFERROR(MATCH($A207&\"#\"&M$1,'[1]Pt1-DATA'!$C:$C,0),0)","v":0},{"$f":"IFERROR(MATCH($A207&\"#\"&N$1,'[1]Pt1-DATA'!$C:$C,0),0)","v":0},{"$f":"IFERROR(MATCH($A207&\"#\"&O$1,'[1]Pt1-DATA'!$C:$C,0),0)","v":0},{"$f":"IFERROR(MATCH($A207&\"#\"&P$1,'[1]Pt1-DATA'!$C:$C,0),0)","v":0},{"$f":"IFERROR(MATCH($A207&\"#\"&Q$1,'[1]Pt1-DATA'!$C:$C,0),0)","v":0},{"$f":"IFERROR(MATCH($A207&\"#\"&R$1,'[1]Pt1-DATA'!$C:$C,0),0)","v":0},{"$f":"IFERROR(MATCH($A207&\"#\"&S$1,'[1]Pt1-DATA'!$C:$C,0),0)","v":0},{"$f":"IFERROR(MATCH($A207&\"#\"&T$1,'[1]Pt1-DATA'!$C:$C,0),0)","v":0}]
[206,"Large Commercial Aircraft","Single Aisle","A320ceo","Airbus A319ceo","CFM International CFM56 - 5B","Narrow Body",null,true,null,{"$f":"IFERROR(MATCH($A208&\"#\"&K$1,'[1]Pt1-DATA'!$C:$C,0),0)","v":272},null,{"$f":"IFERROR(MATCH($A208&\"#\"&M$1,'[1]Pt1-DATA'!$C:$C,0),0)","v":0},{"$f":"IFERROR(MATCH($A208&\"#\"&N$1,'[1]Pt1-DATA'!$C:$C,0),0)","v":0},{"$f":"IFERROR(MATCH($A208&\"#\"&O$1,'[1]Pt1-DATA'!$C:$C,0),0)","v":0},{"$f":"IFERROR(MATCH($A208&\"#\"&P$1,'[1]Pt1-DATA'!$C:$C,0),0)","v":0},{"$f":"IFERROR(MATCH($A208&\"#\"&Q$1,'[1]Pt1-DATA'!$C:$C,0),0)","v":0},{"$f":"IFERROR(MATCH($A208&\"#\"&R$1,'[1]Pt1-DATA'!$C:$C,0),0)","v":0},{"$f":"IFERROR(MATCH($A208&\"#\"&S$1,'[1]Pt1-DATA'!$C:$C,0),0)","v":0},{"$f":"IFERROR(MATCH($A208&\"#\"&T$1,'[1]Pt1-DATA'!$C:$C,0),0)","v":0}]
[510,"Large Commercial Aircraft","Single Aisle","A320ceo","Airbus A319ceo","IAE V2500-A5","Narrow Body",null,true,null,{"$f":"IFERROR(MATCH($A209&\"#\"&K$1,'[1]Pt1-DATA'!$C:$C,0),0)","v":273},null,{"$f":"IFERROR(MATCH($A209&\"#\"&M$1,'[1]Pt1-DATA'!$C:$C,0),0)","v":0},{"$f":"IFERROR(MATCH($A209&\"#\"&N$1,'[1]Pt1-DATA'!$C:$C,0),0)","v":0},{"$f":"IFERROR(MATCH($A209&\"#\"&O$1,'[1]Pt1-DATA'!$C:$C,0),0)","v":0},{"$f":"IFERROR(MATCH($A209&\"#\"&P$1,'[1]Pt1-DATA'!$C:$C,0),0)","v":0},{"$f":"IFERROR(MATCH($A209&\"#\"&Q$1,'[1]Pt1-DATA'!$C:$C,0),0)","v":0},{"$f":"IFERROR(MATCH($A209&\"#\"&R$1,'[1]Pt1-DATA'!$C:$C,0),0)","v":0},{"$f":"IFERROR(MATCH($A209&\"#\"&S$1,'[1]Pt1-DATA'!$C:$C,0),0)","v":0},{"$f":"IFERROR(MATCH($A209&\"#\"&T$1,'[1]Pt1-DATA'!$C:$C,0),0)","v":0}]
[207,"Large Commercial Aircraft","Single Aisle","A320ceo","Airbus A320ceo","CFM International CFM56 - 5B","Narrow Body",null,true,null,{"$f":"IFERROR(MATCH($A210&\"#\"&K$1,'[1]Pt1-DATA'!$C:$C,0),0)","v":274},null,{"$f":"IFERROR(MATCH($A210&\"#\"&M$1,'[1]Pt1-DATA'!$C:$C,0),0)","v":0},{"$f":"IFERROR(MATCH($A210&\"#\"&N$1,'[1]Pt1-DATA'!$C:$C,0),0)","v":0},{"$f":"IFERROR(MATCH($A210&\"#\"&O$1,'[1]Pt1-DATA'!$C:$C,0),0)","v":0},{"$f":"IFERROR(MATCH($A210&\"#\"&P$1,'[1]Pt1-DATA'!$C:$C,0),0)","v":0},{"$f":"IFERROR(MATCH($A210&\"#\"&Q$1,'[1]Pt1-DATA'!$C:$C,0),0)","v":0},{"$f":"IFERROR(MATCH($A210&\"#\"&R$1,'[1]Pt1-DATA'!$C:$C,0),0)","v":0},{"$f":"IFERROR(MATCH($A210&\"#\"&S$1,'[1]Pt1-DATA'!$C:$C,0),0)","v":0},{"$f":"IFERROR(MATCH($A210&\"#\"&T$1,'[1]Pt1-DATA'!$C:$C,0),0)","v":0}]
[511,"Large Commercial Aircraft","Single Aisle","A320ceo","Airbus A320ceo","IAE V2500-A5","Narrow Body",null,true,null,{"$f":"IFERROR(MATCH($A211&\"#\"&K$1,'[1]Pt1-DATA'!$C:$C,0),0)","v":275},null,{"$f":"IFERROR(MATCH($A211&\"#\"&M$1,'[1]Pt1-DATA'!$C:$C,0),0)","v":0},{"$f":"IFERROR(MATCH($A211&\"#\"&N$1,'[1]Pt1-DATA'!$C:$C,0),0)","v":0},{"$f":"IFERROR(MATCH($A211&\"#\"&O$1,'[1]Pt1-DATA'!$C:$C,0),0)","v":0},{"$f":"IFERROR(MATCH($A211&\"#\"&P$1,'[1]Pt1-DATA'!$C:$C,0),0)","v":0},{"$f":"IFERROR(MATCH($A211&\"#\"&Q$1,'[1]Pt1-DATA'!$C:$C,0),0)","v":0},{"$f":"IFERROR(MATCH($A211&\"#\"&R$1,'[1]Pt1-DATA'!$C:$C,0),0)","v":0},{"$f":"IFERROR(MATCH($A211&\"#\"&S$1,'[1]Pt1-DATA'!$C:$C,0),0)","v":0},{"$f":"IFERROR(MATCH($A211&\"#\"&T$1,'[1]Pt1-DATA'!$C:$C,0),0)","v":0}]
[208,"Large Commercial Aircraft","Single Aisle","A320ceo","Airbus A321ceo","CFM International CFM56 - 5B","Narrow Body",null,true,null,{"$f":"IFERROR(MATCH($A212&\"#\"&K$1,'[1]Pt1-DATA'!$C:$C,0),0)","v":276},null,{"$f":"IFERROR(MATCH($A212&\"#\"&M$1,'[1]Pt1-DATA'!$C:$C,0),0)","v":0},{"$f":"IFERROR(MATCH($A212&\"#\"&N$1,'[1]Pt1-DATA'!$C:$C,0),0)","v":0},{"$f":"IFERROR(MATCH($A212&\"#\"&O$1,'[1]Pt1-DATA'!$C:$C,0),0)","v":0},{"$f":"IFERROR(MATCH($A212&\"#\"&P$1,'[1]Pt1-DATA'!$C:$C,0),0)","v":0},{"$f":"IFERROR(MATCH($A212&\"#\"&Q$1,'[1]Pt1-DATA'!$C:$C,0),0)","v":0},{"$f":"IFERROR(MATCH($A212&\"#\"&R$1,'[1]Pt1-DATA'!$C:$C,0),0)","v":0},{"$f":"IFERROR(MATCH($A212&\"#\"&S$1,'[1]Pt1-DATA'!$C:$C,0),0)","v":0},{"$f":"IFERROR(MATCH($A212&\"#\"&T$1,'[1]Pt1-DATA'!$C:$C,0),0)","v":0}]
[512,"Large Commercial Aircraft","Single Aisle","A320ceo","Airbus A321ceo","IAE V2500-A5","Narrow Body",null,true,null,{"$f":"IFERROR(MATCH($A213&\"#\"&K$1,'[1]Pt1-DATA'!$C:$C,0),0)","v":277},null,{"$f":"IFERROR(MATCH($A213&\"#\"&M$1,'[1]Pt1-DATA'!$C:$C,0),0)","v":0},{"$f":"IFERROR(MATCH($A213&\"#\"&N$1,'[1]Pt1-DATA'!$C:$C,0),0)","v":0},{"$f":"IFERROR(MATCH($A213&\"#\"&O$1,'[1]Pt1-DATA'!$C:$C,0),0)","v":0},{"$f":"IFERROR(MATCH($A213&\"#\"&P$1,'[1]Pt1-DATA'!$C:$C,0),0)","v":0},{"$f":"IFERROR(MATCH($A213&\"#\"&Q$1,'[1]Pt1-DATA'!$C:$C,0),0)","v":0},{"$f":"IFERROR(MATCH($A213&\"#\"&R$1,'[1]Pt1-DATA'!$C:$C,0),0)","v":0},{"$f":"IFERROR(MATCH($A213&\"#\"&S$1,'[1]Pt1-DATA'!$C:$C,0),0)","v":0},{"$f":"IFERROR(MATCH($A213&\"#\"&T$1,'[1]Pt1-DATA'!$C:$C,0),0)","v":0}]
[513,"Large Commercial Aircraft","Single Aisle","A320neo","Airbus A319neo","CFM International LEAP-1A","Narrow Body",null,true,null,{"$f":"IFERROR(MATCH($A214&\"#\"&K$1,'[1]Pt1-DATA'!$C:$C,0),0)","v":278},null,{"$f":"IFERROR(MATCH($A214&\"#\"&M$1,'[1]Pt1-DATA'!$C:$C,0),0)","v":0},{"$f":"IFERROR(MATCH($A214&\"#\"&N$1,'[1]Pt1-DATA'!$C:$C,0),0)","v":0},{"$f":"IFERROR(MATCH($A214&\"#\"&O$1,'[1]Pt1-DATA'!$C:$C,0),0)","v":0},{"$f":"IFERROR(MATCH($A214&\"#\"&P$1,'[1]Pt1-DATA'!$C:$C,0),0)","v":0},{"$f":"IFERROR(MATCH($A214&\"#\"&Q$1,'[1]Pt1-DATA'!$C:$C,0),0)","v":0},{"$f":"IFERROR(MATCH($A214&\"#\"&R$1,'[1]Pt1-DATA'!$C:$C,0),0)","v":0},{"$f":"IFERROR(MATCH($A214&\"#\"&S$1,'[1]Pt1-DATA'!$C:$C,0),0)","v":0},{"$f":"IFERROR(MATCH($A214&\"#\"&T$1,'[1]Pt1-DATA'!$C:$C,0),0)","v":0}]
[209,"Large Commercial Aircraft","Single Aisle","A320neo","Airbus A319neo","Pratt & Whitney PW1100G","Narrow Body",null,true,null,{"$f":"IFERROR(MATCH($A215&\"#\"&K$1,'[1]Pt1-DATA'!$C:$C,0),0)","v":279},null,{"$f":"IFERROR(MATCH($A215&\"#\"&M$1,'[1]Pt1-DATA'!$C:$C,0),0)","v":0},{"$f":"IFERROR(MATCH($A215&\"#\"&N$1,'[1]Pt1-DATA'!$C:$C,0),0)","v":0},{"$f":"IFERROR(MATCH($A215&\"#\"&O$1,'[1]Pt1-DATA'!$C:$C,0),0)","v":0},{"$f":"IFERROR(MATCH($A215&\"#\"&P$1,'[1]Pt1-DATA'!$C:$C,0),0)","v":0},{"$f":"IFERROR(MATCH($A215&\"#\"&Q$1,'[1]Pt1-DATA'!$C:$C,0),0)","v":0},{"$f":"IFERROR(MATCH($A215&\"#\"&R$1,'[1]Pt1-DATA'!$C:$C,0),0)","v":0},{"$f":"IFERROR(MATCH($A215&\"#\"&S$1,'[1]Pt1-DATA'!$C:$C,0),0)","v":0},{"$f":"IFERROR(MATCH($A215&\"#\"&T$1,'[1]Pt1-DATA'!$C:$C,0),0)","v":0}]
[514,"Large Commercial Aircraft","Single Aisle","A320neo","Airbus A320neo","CFM International LEAP-1A","Narrow Body",null,true,null,{"$f":"IFERROR(MATCH($A216&\"#\"&K$1,'[1]Pt1-DATA'!$C:$C,0),0)","v":280},null,{"$f":"IFERROR(MATCH($A216&\"#\"&M$1,'[1]Pt1-DATA'!$C:$C,0),0)","v":0},{"$f":"IFERROR(MATCH($A216&\"#\"&N$1,'[1]Pt1-DATA'!$C:$C,0),0)","v":0},{"$f":"IFERROR(MATCH($A216&\"#\"&O$1,'[1]Pt1-DATA'!$C:$C,0),0)","v":0},{"$f":"IFERROR(MATCH($A216&\"#\"&P$1,'[1]Pt1-DATA'!$C:$C,0),0)","v":0},{"$f":"IFERROR(MATCH($A216&\"#\"&Q$1,'[1]Pt1-DATA'!$C:$C,0),0)","v":0},{"$f":"IFERROR(MATCH($A216&\"#\"&R$1,'[1]Pt1-DATA'!$C:$C,0),0)","v":0},{"$f":"IFERROR(MATCH($A216&\"#\"&S$1,'[1]Pt1-DATA'!$C:$C,0),0)","v":0},{"$f":"IFERROR(MATCH($A216&\"#\"&T$1,'[1]Pt1-DATA'!$C:$C,0),0)","v":0}]
[210,"Large Commercial Aircraft","Single Aisle","A320neo","Airbus A320neo","Pratt & Whitney PW1100G","Narrow Body",null,true,null,{"$f":"IFERROR(MATCH($A217&\"#\"&K$1,'[1]Pt1-DATA'!$C:$C,0),0)","v":281},null,{"$f":"IFERROR(MATCH($A217&\"#\"&M$1,'[1]Pt1-DATA'!$C:$C,0),0)","v":0},{"$f":"IFERROR(MATCH($A217&\"#\"&N$1,'[1]Pt1-DATA'!$C:$C,0),0)","v":0},{"$f":"IFERROR(MATCH($A217&\"#\"&O$1,'[1]Pt1-DATA'!$C:$C,0),0)","v":0},{"$f":"IFERROR(MATCH($A217&\"#\"&P$1,'[1]Pt1-DATA'!$C:$C,0),0)","v":0},{"$f":"IFERROR(MATCH($A217&\"#\"&Q$1,'[1]Pt1-DATA'!$C:$C,0),0)","v":0},{"$f":"IFERROR(MATCH($A217&\"#\"&R$1,'[1]Pt1-DATA'!$C:$C,0),0)","v":0},{"$f":"IFERROR(MATCH($A217&\"#\"&S$1,'[1]Pt1-DATA'!$C:$C,0),0)","v":0},{"$f":"IFERROR(MATCH($A217&\"#\"&T$1,'[1]Pt1-DATA'!$C:$C,0),0)","v":0}]
[660,"Large Commercial Aircraft","Single Aisle","A320neo","Airbus A321 LR","CFM International LEAP-1A","Narrow Body",null,true,null,{"$f":"IFERROR(MATCH($A218&\"#\"&K$1,'[1]Pt1-DATA'!$C:$C,0),0)","v":339},null,{"$f":"IFERROR(MATCH($A218&\"#\"&M$1,'[1]Pt1-DATA'!$C:$C,0),0)","v":0},{"$f":"IFERROR(MATCH($A218&\"#\"&N$1,'[1]Pt1-DATA'!$C:$C,0),0)","v":0},{"$f":"IFERROR(MATCH($A218&\"#\"&O$1,'[1]Pt1-DATA'!$C:$C,0),0)","v":0},{"$f":"IFERROR(MATCH($A218&\"#\"&P$1,'[1]Pt1-DATA'!$C:$C,0),0)","v":0},{"$f":"IFERROR(MATCH($A218&\"#\"&Q$1,'[1]Pt1-DATA'!$C:$C,0),0)","v":0},{"$f":"IFERROR(MATCH($A218&\"#\"&R$1,'[1]Pt1-DATA'!$C:$C,0),0)","v":0},{"$f":"IFERROR(MATCH($A218&\"#\"&S$1,'[1]Pt1-DATA'!$C:$C,0),0)","v":0},{"$f":"IFERROR(MATCH($A218&\"#\"&T$1,'[1]Pt1-DATA'!$C:$C,0),0)","v":0}]
[661,"Large Commercial Aircraft","Single Aisle","A320neo","Airbus A321 LR","Pratt & Whitney PW1100G","Narrow Body",null,true,null,{"$f":"IFERROR(MATCH($A219&\"#\"&K$1,'[1]Pt1-DATA'!$C:$C,0),0)","v":340},null,{"$f":"IFERROR(MATCH($A219&\"#\"&M$1,'[1]Pt1-DATA'!$C:$C,0),0)","v":0},{"$f":"IFERROR(MATCH($A219&\"#\"&N$1,'[1]Pt1-DATA'!$C:$C,0),0)","v":0},{"$f":"IFERROR(MATCH($A219&\"#\"&O$1,'[1]Pt1-DATA'!$C:$C,0),0)","v":0},{"$f":"IFERROR(MATCH($A219&\"#\"&P$1,'[1]Pt1-DATA'!$C:$C,0),0)","v":0},{"$f":"IFERROR(MATCH($A219&\"#\"&Q$1,'[1]Pt1-DATA'!$C:$C,0),0)","v":0},{"$f":"IFERROR(MATCH($A219&\"#\"&R$1,'[1]Pt1-DATA'!$C:$C,0),0)","v":0},{"$f":"IFERROR(MATCH($A219&\"#\"&S$1,'[1]Pt1-DATA'!$C:$C,0),0)","v":0},{"$f":"IFERROR(MATCH($A219&\"#\"&T$1,'[1]Pt1-DATA'!$C:$C,0),0)","v":0}]
[662,"Large Commercial Aircraft","Single Aisle","A320neo","Airbus A321 XLR","CFM International LEAP-1A","Narrow Body",null,true,null,{"$f":"IFERROR(MATCH($A220&\"#\"&K$1,'[1]Pt1-DATA'!$C:$C,0),0)","v":341},null,{"$f":"IFERROR(MATCH($A220&\"#\"&M$1,'[1]Pt1-DATA'!$C:$C,0),0)","v":0},{"$f":"IFERROR(MATCH($A220&\"#\"&N$1,'[1]Pt1-DATA'!$C:$C,0),0)","v":0},{"$f":"IFERROR(MATCH($A220&\"#\"&O$1,'[1]Pt1-DATA'!$C:$C,0),0)","v":0},{"$f":"IFERROR(MATCH($A220&\"#\"&P$1,'[1]Pt1-DATA'!$C:$C,0),0)","v":0},{"$f":"IFERROR(MATCH($A220&\"#\"&Q$1,'[1]Pt1-DATA'!$C:$C,0),0)","v":0},{"$f":"IFERROR(MATCH($A220&\"#\"&R$1,'[1]Pt1-DATA'!$C:$C,0),0)","v":0},{"$f":"IFERROR(MATCH($A220&\"#\"&S$1,'[1]Pt1-DATA'!$C:$C,0),0)","v":0},{"$f":"IFERROR(MATCH($A220&\"#\"&T$1,'[1]Pt1-DATA'!$C:$C,0),0)","v":0}]
[663,"Large Commercial Aircraft","Single Aisle","A320neo","Airbus A321 XLR","Pratt & Whitney PW1100G","Narrow Body",null,true,null,{"$f":"IFERROR(MATCH($A221&\"#\"&K$1,'[1]Pt1-DATA'!$C:$C,0),0)","v":335},null,{"$f":"IFERROR(MATCH($A221&\"#\"&M$1,'[1]Pt1-DATA'!$C:$C,0),0)","v":0},{"$f":"IFERROR(MATCH($A221&\"#\"&N$1,'[1]Pt1-DATA'!$C:$C,0),0)","v":0},{"$f":"IFERROR(MATCH($A221&\"#\"&O$1,'[1]Pt1-DATA'!$C:$C,0),0)","v":0},{"$f":"IFERROR(MATCH($A221&\"#\"&P$1,'[1]Pt1-DATA'!$C:$C,0),0)","v":0},{"$f":"IFERROR(MATCH($A221&\"#\"&Q$1,'[1]Pt1-DATA'!$C:$C,0),0)","v":0},{"$f":"IFERROR(MATCH($A221&\"#\"&R$1,'[1]Pt1-DATA'!$C:$C,0),0)","v":0},{"$f":"IFERROR(MATCH($A221&\"#\"&S$1,'[1]Pt1-DATA'!$C:$C,0),0)","v":0},{"$f":"IFERROR(MATCH($A221&\"#\"&T$1,'[1]Pt1-DATA'!$C:$C,0),0)","v":0}]
[515,"Large Commercial Aircraft","Single Aisle","A320neo","Airbus A321neo","CFM International LEAP-1A","Narrow Body",null,true,null,{"$f":"IFERROR(MATCH($A222&\"#\"&K$1,'[1]Pt1-DATA'!$C:$C,0),0)","v":264},null,{"$f":"IFERROR(MATCH($A222&\"#\"&M$1,'[1]Pt1-DATA'!$C:$C,0),0)","v":0},{"$f":"IFERROR(MATCH($A222&\"#\"&N$1,'[1]Pt1-DATA'!$C:$C,0),0)","v":0},{"$f":"IFERROR(MATCH($A222&\"#\"&O$1,'[1]Pt1-DATA'!$C:$C,0),0)","v":0},{"$f":"IFERROR(MATCH($A222&\"#\"&P$1,'[1]Pt1-DATA'!$C:$C,0),0)","v":0},{"$f":"IFERROR(MATCH($A222&\"#\"&Q$1,'[1]Pt1-DATA'!$C:$C,0),0)","v":0},{"$f":"IFERROR(MATCH($A222&\"#\"&R$1,'[1]Pt1-DATA'!$C:$C,0),0)","v":0},{"$f":"IFERROR(MATCH($A222&\"#\"&S$1,'[1]Pt1-DATA'!$C:$C,0),0)","v":0},{"$f":"IFERROR(MATCH($A222&\"#\"&T$1,'[1]Pt1-DATA'!$C:$C,0),0)","v":0}]
[211,"Large Commercial Aircraft","Single Aisle","A320neo","Airbus A321neo","Pratt & Whitney PW1100G","Narrow Body",null,true,null,{"$f":"IFERROR(MATCH($A223&\"#\"&K$1,'[1]Pt1-DATA'!$C:$C,0),0)","v":265},null,{"$f":"IFERROR(MATCH($A223&\"#\"&M$1,'[1]Pt1-DATA'!$C:$C,0),0)","v":0},{"$f":"IFERROR(MATCH($A223&\"#\"&N$1,'[1]Pt1-DATA'!$C:$C,0),0)","v":0},{"$f":"IFERROR(MATCH($A223&\"#\"&O$1,'[1]Pt1-DATA'!$C:$C,0),0)","v":0},{"$f":"IFERROR(MATCH($A223&\"#\"&P$1,'[1]Pt1-DATA'!$C:$C,0),0)","v":0},{"$f":"IFERROR(MATCH($A223&\"#\"&Q$1,'[1]Pt1-DATA'!$C:$C,0),0)","v":0},{"$f":"IFERROR(MATCH($A223&\"#\"&R$1,'[1]Pt1-DATA'!$C:$C,0),0)","v":0},{"$f":"IFERROR(MATCH($A223&\"#\"&S$1,'[1]Pt1-DATA'!$C:$C,0),0)","v":0},{"$f":"IFERROR(MATCH($A223&\"#\"&T$1,'[1]Pt1-DATA'!$C:$C,0),0)","v":0}]
[654,"Large Commercial Aircraft","Single Aisle","A320neo","Airbus A322X","CFM International LEAP-1A","Narrow Body",null,true,null,{"$f":"IFERROR(MATCH($A224&\"#\"&K$1,'[1]Pt1-DATA'!$C:$C,0),0)","v":336},null,{"$f":"IFERROR(MATCH($A224&\"#\"&M$1,'[1]Pt1-DATA'!$C:$C,0),0)","v":0},{"$f":"IFERROR(MATCH($A224&\"#\"&N$1,'[1]Pt1-DATA'!$C:$C,0),0)","v":7397},{"$f":"IFERROR(MATCH($A224&\"#\"&O$1,'[1]Pt1-DATA'!$C:$C,0),0)","v":0},{"$f":"IFERROR(MATCH($A224&\"#\"&P$1,'[1]Pt1-DATA'!$C:$C,0),0)","v":0},{"$f":"IFERROR(MATCH($A224&\"#\"&Q$1,'[1]Pt1-DATA'!$C:$C,0),0)","v":0},{"$f":"IFERROR(MATCH($A224&\"#\"&R$1,'[1]Pt1-DATA'!$C:$C,0),0)","v":0},{"$f":"IFERROR(MATCH($A224&\"#\"&S$1,'[1]Pt1-DATA'!$C:$C,0),0)","v":0},{"$f":"IFERROR(MATCH($A224&\"#\"&T$1,'[1]Pt1-DATA'!$C:$C,0),0)","v":0}]
[655,"Large Commercial Aircraft","Single Aisle","A320neo","Airbus A322X","Pratt & Whitney PW1100G","Narrow Body",null,true,null,{"$f":"IFERROR(MATCH($A225&\"#\"&K$1,'[1]Pt1-DATA'!$C:$C,0),0)","v":337},null,{"$f":"IFERROR(MATCH($A225&\"#\"&M$1,'[1]Pt1-DATA'!$C:$C,0),0)","v":0},{"$f":"IFERROR(MATCH($A225&\"#\"&N$1,'[1]Pt1-DATA'!$C:$C,0),0)","v":7398},{"$f":"IFERROR(MATCH($A225&\"#\"&O$1,'[1]Pt1-DATA'!$C:$C,0),0)","v":0},{"$f":"IFERROR(MATCH($A225&\"#\"&P$1,'[1]Pt1-DATA'!$C:$C,0),0)","v":0},{"$f":"IFERROR(MATCH($A225&\"#\"&Q$1,'[1]Pt1-DATA'!$C:$C,0),0)","v":0},{"$f":"IFERROR(MATCH($A225&\"#\"&R$1,'[1]Pt1-DATA'!$C:$C,0),0)","v":0},{"$f":"IFERROR(MATCH($A225&\"#\"&S$1,'[1]Pt1-DATA'!$C:$C,0),0)","v":0},{"$f":"IFERROR(MATCH($A225&\"#\"&T$1,'[1]Pt1-DATA'!$C:$C,0),0)","v":0}]
[299,"Large Commercial Aircraft","Single Aisle","Boeing 717","Boeing 717","Rolls-Royce BR715","Narrow Body",null,true,null,{"$f":"IFERROR(MATCH($A226&\"#\"&K$1,'[1]Pt1-DATA'!$C:$C,0),0)","v":266},null,{"$f":"IFERROR(MATCH($A226&\"#\"&M$1,'[1]Pt1-DATA'!$C:$C,0),0)","v":0},{"$f":"IFERROR(MATCH($A226&\"#\"&N$1,'[1]Pt1-DATA'!$C:$C,0),0)","v":0},{"$f":"IFERROR(MATCH($A226&\"#\"&O$1,'[1]Pt1-DATA'!$C:$C,0),0)","v":0},{"$f":"IFERROR(MATCH($A226&\"#\"&P$1,'[1]Pt1-DATA'!$C:$C,0),0)","v":0},{"$f":"IFERROR(MATCH($A226&\"#\"&Q$1,'[1]Pt1-DATA'!$C:$C,0),0)","v":0},{"$f":"IFERROR(MATCH($A226&\"#\"&R$1,'[1]Pt1-DATA'!$C:$C,0),0)","v":0},{"$f":"IFERROR(MATCH($A226&\"#\"&S$1,'[1]Pt1-DATA'!$C:$C,0),0)","v":0},{"$f":"IFERROR(MATCH($A226&\"#\"&T$1,'[1]Pt1-DATA'!$C:$C,0),0)","v":0}]
[534,"Large Commercial Aircraft","Single Aisle","Boeing 737 Classic","Boeing 737 Classic: 737-300","CFM International CFM56 - 3 ","Narrow Body",null,true,null,{"$f":"IFERROR(MATCH($A227&\"#\"&K$1,'[1]Pt1-DATA'!$C:$C,0),0)","v":267},null,{"$f":"IFERROR(MATCH($A227&\"#\"&M$1,'[1]Pt1-DATA'!$C:$C,0),0)","v":0},{"$f":"IFERROR(MATCH($A227&\"#\"&N$1,'[1]Pt1-DATA'!$C:$C,0),0)","v":0},{"$f":"IFERROR(MATCH($A227&\"#\"&O$1,'[1]Pt1-DATA'!$C:$C,0),0)","v":0},{"$f":"IFERROR(MATCH($A227&\"#\"&P$1,'[1]Pt1-DATA'!$C:$C,0),0)","v":0},{"$f":"IFERROR(MATCH($A227&\"#\"&Q$1,'[1]Pt1-DATA'!$C:$C,0),0)","v":0},{"$f":"IFERROR(MATCH($A227&\"#\"&R$1,'[1]Pt1-DATA'!$C:$C,0),0)","v":0},{"$f":"IFERROR(MATCH($A227&\"#\"&S$1,'[1]Pt1-DATA'!$C:$C,0),0)","v":0},{"$f":"IFERROR(MATCH($A227&\"#\"&T$1,'[1]Pt1-DATA'!$C:$C,0),0)","v":0}]
[535,"Large Commercial Aircraft","Single Aisle","Boeing 737 Classic","Boeing 737 Classic: 737-400","CFM International CFM56 - 3 ","Narrow Body",null,true,null,{"$f":"IFERROR(MATCH($A228&\"#\"&K$1,'[1]Pt1-DATA'!$C:$C,0),0)","v":259},null,{"$f":"IFERROR(MATCH($A228&\"#\"&M$1,'[1]Pt1-DATA'!$C:$C,0),0)","v":0},{"$f":"IFERROR(MATCH($A228&\"#\"&N$1,'[1]Pt1-DATA'!$C:$C,0),0)","v":0},{"$f":"IFERROR(MATCH($A228&\"#\"&O$1,'[1]Pt1-DATA'!$C:$C,0),0)","v":0},{"$f":"IFERROR(MATCH($A228&\"#\"&P$1,'[1]Pt1-DATA'!$C:$C,0),0)","v":0},{"$f":"IFERROR(MATCH($A228&\"#\"&Q$1,'[1]Pt1-DATA'!$C:$C,0),0)","v":0},{"$f":"IFERROR(MATCH($A228&\"#\"&R$1,'[1]Pt1-DATA'!$C:$C,0),0)","v":0},{"$f":"IFERROR(MATCH($A228&\"#\"&S$1,'[1]Pt1-DATA'!$C:$C,0),0)","v":0},{"$f":"IFERROR(MATCH($A228&\"#\"&T$1,'[1]Pt1-DATA'!$C:$C,0),0)","v":0}]
[536,"Large Commercial Aircraft","Single Aisle","Boeing 737 Classic","Boeing 737 Classic: 737-500","CFM International CFM56 - 3 ","Narrow Body",null,true,null,{"$f":"IFERROR(MATCH($A229&\"#\"&K$1,'[1]Pt1-DATA'!$C:$C,0),0)","v":260},null,{"$f":"IFERROR(MATCH($A229&\"#\"&M$1,'[1]Pt1-DATA'!$C:$C,0),0)","v":0},{"$f":"IFERROR(MATCH($A229&\"#\"&N$1,'[1]Pt1-DATA'!$C:$C,0),0)","v":0},{"$f":"IFERROR(MATCH($A229&\"#\"&O$1,'[1]Pt1-DATA'!$C:$C,0),0)","v":0},{"$f":"IFERROR(MATCH($A229&\"#\"&P$1,'[1]Pt1-DATA'!$C:$C,0),0)","v":0},{"$f":"IFERROR(MATCH($A229&\"#\"&Q$1,'[1]Pt1-DATA'!$C:$C,0),0)","v":0},{"$f":"IFERROR(MATCH($A229&\"#\"&R$1,'[1]Pt1-DATA'!$C:$C,0),0)","v":0},{"$f":"IFERROR(MATCH($A229&\"#\"&S$1,'[1]Pt1-DATA'!$C:$C,0),0)","v":0},{"$f":"IFERROR(MATCH($A229&\"#\"&T$1,'[1]Pt1-DATA'!$C:$C,0),0)","v":0}]
[309,"Large Commercial Aircraft","Single Aisle","Boeing 737MAX","Boeing 737 MAX: 737 MAX 10","CFM International LEAP-1B","Narrow Body",null,true,null,{"$f":"IFERROR(MATCH($A230&\"#\"&K$1,'[1]Pt1-DATA'!$C:$C,0),0)","v":261},null,{"$f":"IFERROR(MATCH($A230&\"#\"&M$1,'[1]Pt1-DATA'!$C:$C,0),0)","v":0},{"$f":"IFERROR(MATCH($A230&\"#\"&N$1,'[1]Pt1-DATA'!$C:$C,0),0)","v":0},{"$f":"IFERROR(MATCH($A230&\"#\"&O$1,'[1]Pt1-DATA'!$C:$C,0),0)","v":0},{"$f":"IFERROR(MATCH($A230&\"#\"&P$1,'[1]Pt1-DATA'!$C:$C,0),0)","v":0},{"$f":"IFERROR(MATCH($A230&\"#\"&Q$1,'[1]Pt1-DATA'!$C:$C,0),0)","v":0},{"$f":"IFERROR(MATCH($A230&\"#\"&R$1,'[1]Pt1-DATA'!$C:$C,0),0)","v":0},{"$f":"IFERROR(MATCH($A230&\"#\"&S$1,'[1]Pt1-DATA'!$C:$C,0),0)","v":0},{"$f":"IFERROR(MATCH($A230&\"#\"&T$1,'[1]Pt1-DATA'!$C:$C,0),0)","v":0}]
[195,"Large Commercial Aircraft","Single Aisle","Boeing 737MAX","Boeing 737 MAX: 737 MAX 7","CFM International LEAP-1B","Narrow Body",null,true,null,{"$f":"IFERROR(MATCH($A231&\"#\"&K$1,'[1]Pt1-DATA'!$C:$C,0),0)","v":262},null,{"$f":"IFERROR(MATCH($A231&\"#\"&M$1,'[1]Pt1-DATA'!$C:$C,0),0)","v":0},{"$f":"IFERROR(MATCH($A231&\"#\"&N$1,'[1]Pt1-DATA'!$C:$C,0),0)","v":0},{"$f":"IFERROR(MATCH($A231&\"#\"&O$1,'[1]Pt1-DATA'!$C:$C,0),0)","v":0},{"$f":"IFERROR(MATCH($A231&\"#\"&P$1,'[1]Pt1-DATA'!$C:$C,0),0)","v":0},{"$f":"IFERROR(MATCH($A231&\"#\"&Q$1,'[1]Pt1-DATA'!$C:$C,0),0)","v":0},{"$f":"IFERROR(MATCH($A231&\"#\"&R$1,'[1]Pt1-DATA'!$C:$C,0),0)","v":0},{"$f":"IFERROR(MATCH($A231&\"#\"&S$1,'[1]Pt1-DATA'!$C:$C,0),0)","v":0},{"$f":"IFERROR(MATCH($A231&\"#\"&T$1,'[1]Pt1-DATA'!$C:$C,0),0)","v":0}]
[196,"Large Commercial Aircraft","Single Aisle","Boeing 737MAX","Boeing 737 MAX: 737 MAX 8","CFM International LEAP-1B","Narrow Body",null,true,null,{"$f":"IFERROR(MATCH($A232&\"#\"&K$1,'[1]Pt1-DATA'!$C:$C,0),0)","v":263},null,{"$f":"IFERROR(MATCH($A232&\"#\"&M$1,'[1]Pt1-DATA'!$C:$C,0),0)","v":0},{"$f":"IFERROR(MATCH($A232&\"#\"&N$1,'[1]Pt1-DATA'!$C:$C,0),0)","v":0},{"$f":"IFERROR(MATCH($A232&\"#\"&O$1,'[1]Pt1-DATA'!$C:$C,0),0)","v":0},{"$f":"IFERROR(MATCH($A232&\"#\"&P$1,'[1]Pt1-DATA'!$C:$C,0),0)","v":0},{"$f":"IFERROR(MATCH($A232&\"#\"&Q$1,'[1]Pt1-DATA'!$C:$C,0),0)","v":0},{"$f":"IFERROR(MATCH($A232&\"#\"&R$1,'[1]Pt1-DATA'!$C:$C,0),0)","v":0},{"$f":"IFERROR(MATCH($A232&\"#\"&S$1,'[1]Pt1-DATA'!$C:$C,0),0)","v":0},{"$f":"IFERROR(MATCH($A232&\"#\"&T$1,'[1]Pt1-DATA'!$C:$C,0),0)","v":0}]
[197,"Large Commercial Aircraft","Single Aisle","Boeing 737MAX","Boeing 737 MAX: 737 MAX 9","CFM International LEAP-1B","Narrow Body",null,true,null,{"$f":"IFERROR(MATCH($A233&\"#\"&K$1,'[1]Pt1-DATA'!$C:$C,0),0)","v":324},null,{"$f":"IFERROR(MATCH($A233&\"#\"&M$1,'[1]Pt1-DATA'!$C:$C,0),0)","v":0},{"$f":"IFERROR(MATCH($A233&\"#\"&N$1,'[1]Pt1-DATA'!$C:$C,0),0)","v":0},{"$f":"IFERROR(MATCH($A233&\"#\"&O$1,'[1]Pt1-DATA'!$C:$C,0),0)","v":0},{"$f":"IFERROR(MATCH($A233&\"#\"&P$1,'[1]Pt1-DATA'!$C:$C,0),0)","v":0},{"$f":"IFERROR(MATCH($A233&\"#\"&Q$1,'[1]Pt1-DATA'!$C:$C,0),0)","v":0},{"$f":"IFERROR(MATCH($A233&\"#\"&R$1,'[1]Pt1-DATA'!$C:$C,0),0)","v":0},{"$f":"IFERROR(MATCH($A233&\"#\"&S$1,'[1]Pt1-DATA'!$C:$C,0),0)","v":0},{"$f":"IFERROR(MATCH($A233&\"#\"&T$1,'[1]Pt1-DATA'!$C:$C,0),0)","v":0}]
[300,"Large Commercial Aircraft","Single Aisle","Boeing 737NG","Boeing 737-600","CFM International CFM56 - 7B","Narrow Body",null,true,null,{"$f":"IFERROR(MATCH($A234&\"#\"&K$1,'[1]Pt1-DATA'!$C:$C,0),0)","v":325},null,{"$f":"IFERROR(MATCH($A234&\"#\"&M$1,'[1]Pt1-DATA'!$C:$C,0),0)","v":0},{"$f":"IFERROR(MATCH($A234&\"#\"&N$1,'[1]Pt1-DATA'!$C:$C,0),0)","v":0},{"$f":"IFERROR(MATCH($A234&\"#\"&O$1,'[1]Pt1-DATA'!$C:$C,0),0)","v":0},{"$f":"IFERROR(MATCH($A234&\"#\"&P$1,'[1]Pt1-DATA'!$C:$C,0),0)","v":0},{"$f":"IFERROR(MATCH($A234&\"#\"&Q$1,'[1]Pt1-DATA'!$C:$C,0),0)","v":0},{"$f":"IFERROR(MATCH($A234&\"#\"&R$1,'[1]Pt1-DATA'!$C:$C,0),0)","v":0},{"$f":"IFERROR(MATCH($A234&\"#\"&S$1,'[1]Pt1-DATA'!$C:$C,0),0)","v":0},{"$f":"IFERROR(MATCH($A234&\"#\"&T$1,'[1]Pt1-DATA'!$C:$C,0),0)","v":0}]
[192,"Large Commercial Aircraft","Single Aisle","Boeing 737NG","Boeing 737-700","CFM International CFM56 - 7B","Narrow Body",null,true,null,{"$f":"IFERROR(MATCH($A235&\"#\"&K$1,'[1]Pt1-DATA'!$C:$C,0),0)","v":326},null,{"$f":"IFERROR(MATCH($A235&\"#\"&M$1,'[1]Pt1-DATA'!$C:$C,0),0)","v":0},{"$f":"IFERROR(MATCH($A235&\"#\"&N$1,'[1]Pt1-DATA'!$C:$C,0),0)","v":0},{"$f":"IFERROR(MATCH($A235&\"#\"&O$1,'[1]Pt1-DATA'!$C:$C,0),0)","v":0},{"$f":"IFERROR(MATCH($A235&\"#\"&P$1,'[1]Pt1-DATA'!$C:$C,0),0)","v":0},{"$f":"IFERROR(MATCH($A235&\"#\"&Q$1,'[1]Pt1-DATA'!$C:$C,0),0)","v":0},{"$f":"IFERROR(MATCH($A235&\"#\"&R$1,'[1]Pt1-DATA'!$C:$C,0),0)","v":0},{"$f":"IFERROR(MATCH($A235&\"#\"&S$1,'[1]Pt1-DATA'!$C:$C,0),0)","v":0},{"$f":"IFERROR(MATCH($A235&\"#\"&T$1,'[1]Pt1-DATA'!$C:$C,0),0)","v":0}]
[193,"Large Commercial Aircraft","Single Aisle","Boeing 737NG","Boeing 737-800","CFM International CFM56 - 7B","Narrow Body",null,true,null,{"$f":"IFERROR(MATCH($A236&\"#\"&K$1,'[1]Pt1-DATA'!$C:$C,0),0)","v":327},null,{"$f":"IFERROR(MATCH($A236&\"#\"&M$1,'[1]Pt1-DATA'!$C:$C,0),0)","v":0},{"$f":"IFERROR(MATCH($A236&\"#\"&N$1,'[1]Pt1-DATA'!$C:$C,0),0)","v":0},{"$f":"IFERROR(MATCH($A236&\"#\"&O$1,'[1]Pt1-DATA'!$C:$C,0),0)","v":0},{"$f":"IFERROR(MATCH($A236&\"#\"&P$1,'[1]Pt1-DATA'!$C:$C,0),0)","v":0},{"$f":"IFERROR(MATCH($A236&\"#\"&Q$1,'[1]Pt1-DATA'!$C:$C,0),0)","v":0},{"$f":"IFERROR(MATCH($A236&\"#\"&R$1,'[1]Pt1-DATA'!$C:$C,0),0)","v":0},{"$f":"IFERROR(MATCH($A236&\"#\"&S$1,'[1]Pt1-DATA'!$C:$C,0),0)","v":0},{"$f":"IFERROR(MATCH($A236&\"#\"&T$1,'[1]Pt1-DATA'!$C:$C,0),0)","v":0}]
[194,"Large Commercial Aircraft","Single Aisle","Boeing 737NG","Boeing 737-900","CFM International CFM56 - 7B","Narrow Body",null,true,null,{"$f":"IFERROR(MATCH($A237&\"#\"&K$1,'[1]Pt1-DATA'!$C:$C,0),0)","v":328},null,{"$f":"IFERROR(MATCH($A237&\"#\"&M$1,'[1]Pt1-DATA'!$C:$C,0),0)","v":0},{"$f":"IFERROR(MATCH($A237&\"#\"&N$1,'[1]Pt1-DATA'!$C:$C,0),0)","v":0},{"$f":"IFERROR(MATCH($A237&\"#\"&O$1,'[1]Pt1-DATA'!$C:$C,0),0)","v":0},{"$f":"IFERROR(MATCH($A237&\"#\"&P$1,'[1]Pt1-DATA'!$C:$C,0),0)","v":0},{"$f":"IFERROR(MATCH($A237&\"#\"&Q$1,'[1]Pt1-DATA'!$C:$C,0),0)","v":0},{"$f":"IFERROR(MATCH($A237&\"#\"&R$1,'[1]Pt1-DATA'!$C:$C,0),0)","v":0},{"$f":"IFERROR(MATCH($A237&\"#\"&S$1,'[1]Pt1-DATA'!$C:$C,0),0)","v":0},{"$f":"IFERROR(MATCH($A237&\"#\"&T$1,'[1]Pt1-DATA'!$C:$C,0),0)","v":0}]
[522,"Large Commercial Aircraft","Single Aisle","Boeing 757","Boeing 757","Pratt & Whitney PW2000","Narrow Body",null,true,null,{"$f":"IFERROR(MATCH($A238&\"#\"&K$1,'[1]Pt1-DATA'!$C:$C,0),0)","v":329},null,{"$f":"IFERROR(MATCH($A238&\"#\"&M$1,'[1]Pt1-DATA'!$C:$C,0),0)","v":0},{"$f":"IFERROR(MATCH($A238&\"#\"&N$1,'[1]Pt1-DATA'!$C:$C,0),0)","v":0},{"$f":"IFERROR(MATCH($A238&\"#\"&O$1,'[1]Pt1-DATA'!$C:$C,0),0)","v":0},{"$f":"IFERROR(MATCH($A238&\"#\"&P$1,'[1]Pt1-DATA'!$C:$C,0),0)","v":0},{"$f":"IFERROR(MATCH($A238&\"#\"&Q$1,'[1]Pt1-DATA'!$C:$C,0),0)","v":0},{"$f":"IFERROR(MATCH($A238&\"#\"&R$1,'[1]Pt1-DATA'!$C:$C,0),0)","v":0},{"$f":"IFERROR(MATCH($A238&\"#\"&S$1,'[1]Pt1-DATA'!$C:$C,0),0)","v":0},{"$f":"IFERROR(MATCH($A238&\"#\"&T$1,'[1]Pt1-DATA'!$C:$C,0),0)","v":0}]
[230,"Large Commercial Aircraft","Single Aisle","Boeing 757","Boeing 757","Rolls-Royce RB211-534E4/E4B","Narrow Body",null,true,null,{"$f":"IFERROR(MATCH($A239&\"#\"&K$1,'[1]Pt1-DATA'!$C:$C,0),0)","v":330},null,{"$f":"IFERROR(MATCH($A239&\"#\"&M$1,'[1]Pt1-DATA'!$C:$C,0),0)","v":0},{"$f":"IFERROR(MATCH($A239&\"#\"&N$1,'[1]Pt1-DATA'!$C:$C,0),0)","v":0},{"$f":"IFERROR(MATCH($A239&\"#\"&O$1,'[1]Pt1-DATA'!$C:$C,0),0)","v":0},{"$f":"IFERROR(MATCH($A239&\"#\"&P$1,'[1]Pt1-DATA'!$C:$C,0),0)","v":0},{"$f":"IFERROR(MATCH($A239&\"#\"&Q$1,'[1]Pt1-DATA'!$C:$C,0),0)","v":0},{"$f":"IFERROR(MATCH($A239&\"#\"&R$1,'[1]Pt1-DATA'!$C:$C,0),0)","v":0},{"$f":"IFERROR(MATCH($A239&\"#\"&S$1,'[1]Pt1-DATA'!$C:$C,0),0)","v":0},{"$f":"IFERROR(MATCH($A239&\"#\"&T$1,'[1]Pt1-DATA'!$C:$C,0),0)","v":0}]
[612,"Large Commercial Aircraft","Single Aisle","Boeing New Single Aisle (NSA)","Boeing New Single Aisle (NSA)","CFM International LEAP (NSA)","Narrow Body",null,true,null,{"$f":"IFERROR(MATCH($A240&\"#\"&K$1,'[1]Pt1-DATA'!$C:$C,0),0)","v":331},null,{"$f":"IFERROR(MATCH($A240&\"#\"&M$1,'[1]Pt1-DATA'!$C:$C,0),0)","v":0},{"$f":"IFERROR(MATCH($A240&\"#\"&N$1,'[1]Pt1-DATA'!$C:$C,0),0)","v":7400},{"$f":"IFERROR(MATCH($A240&\"#\"&O$1,'[1]Pt1-DATA'!$C:$C,0),0)","v":0},{"$f":"IFERROR(MATCH($A240&\"#\"&P$1,'[1]Pt1-DATA'!$C:$C,0),0)","v":0},{"$f":"IFERROR(MATCH($A240&\"#\"&Q$1,'[1]Pt1-DATA'!$C:$C,0),0)","v":0},{"$f":"IFERROR(MATCH($A240&\"#\"&R$1,'[1]Pt1-DATA'!$C:$C,0),0)","v":0},{"$f":"IFERROR(MATCH($A240&\"#\"&S$1,'[1]Pt1-DATA'!$C:$C,0),0)","v":0},{"$f":"IFERROR(MATCH($A240&\"#\"&T$1,'[1]Pt1-DATA'!$C:$C,0),0)","v":0}]
[18,"Large Commercial Aircraft","Single Aisle","Comac C919","Comac C919","CFM International LEAP-1C","wide body (IMA)",null,true,null,{"$f":"IFERROR(MATCH($A241&\"#\"&K$1,'[1]Pt1-DATA'!$C:$C,0),0)","v":332},null,{"$f":"IFERROR(MATCH($A241&\"#\"&M$1,'[1]Pt1-DATA'!$C:$C,0),0)","v":0},{"$f":"IFERROR(MATCH($A241&\"#\"&N$1,'[1]Pt1-DATA'!$C:$C,0),0)","v":7396},{"$f":"IFERROR(MATCH($A241&\"#\"&O$1,'[1]Pt1-DATA'!$C:$C,0),0)","v":0},{"$f":"IFERROR(MATCH($A241&\"#\"&P$1,'[1]Pt1-DATA'!$C:$C,0),0)","v":0},{"$f":"IFERROR(MATCH($A241&\"#\"&Q$1,'[1]Pt1-DATA'!$C:$C,0),0)","v":0},{"$f":"IFERROR(MATCH($A241&\"#\"&R$1,'[1]Pt1-DATA'!$C:$C,0),0)","v":0},{"$f":"IFERROR(MATCH($A241&\"#\"&S$1,'[1]Pt1-DATA'!$C:$C,0),0)","v":0},{"$f":"IFERROR(MATCH($A241&\"#\"&T$1,'[1]Pt1-DATA'!$C:$C,0),0)","v":0}]
[541,"Large Commercial Aircraft","Single Aisle","Irkut MC-21","Irkut MC-21","Aviadvigatel PD-14","Narrow Body",null,true,null,{"$f":"IFERROR(MATCH($A242&\"#\"&K$1,'[1]Pt1-DATA'!$C:$C,0),0)","v":333},null,{"$f":"IFERROR(MATCH($A242&\"#\"&M$1,'[1]Pt1-DATA'!$C:$C,0),0)","v":0},{"$f":"IFERROR(MATCH($A242&\"#\"&N$1,'[1]Pt1-DATA'!$C:$C,0),0)","v":0},{"$f":"IFERROR(MATCH($A242&\"#\"&O$1,'[1]Pt1-DATA'!$C:$C,0),0)","v":0},{"$f":"IFERROR(MATCH($A242&\"#\"&P$1,'[1]Pt1-DATA'!$C:$C,0),0)","v":0},{"$f":"IFERROR(MATCH($A242&\"#\"&Q$1,'[1]Pt1-DATA'!$C:$C,0),0)","v":0},{"$f":"IFERROR(MATCH($A242&\"#\"&R$1,'[1]Pt1-DATA'!$C:$C,0),0)","v":0},{"$f":"IFERROR(MATCH($A242&\"#\"&S$1,'[1]Pt1-DATA'!$C:$C,0),0)","v":0},{"$f":"IFERROR(MATCH($A242&\"#\"&T$1,'[1]Pt1-DATA'!$C:$C,0),0)","v":0}]
[19,"Large Commercial Aircraft","Single Aisle","Irkut MC-21","Irkut MC-21","Pratt & Whitney PW1400G","Narrow Body",null,true,null,{"$f":"IFERROR(MATCH($A243&\"#\"&K$1,'[1]Pt1-DATA'!$C:$C,0),0)","v":334},null,{"$f":"IFERROR(MATCH($A243&\"#\"&M$1,'[1]Pt1-DATA'!$C:$C,0),0)","v":0},{"$f":"IFERROR(MATCH($A243&\"#\"&N$1,'[1]Pt1-DATA'!$C:$C,0),0)","v":0},{"$f":"IFERROR(MATCH($A243&\"#\"&O$1,'[1]Pt1-DATA'!$C:$C,0),0)","v":0},{"$f":"IFERROR(MATCH($A243&\"#\"&P$1,'[1]Pt1-DATA'!$C:$C,0),0)","v":0},{"$f":"IFERROR(MATCH($A243&\"#\"&Q$1,'[1]Pt1-DATA'!$C:$C,0),0)","v":0},{"$f":"IFERROR(MATCH($A243&\"#\"&R$1,'[1]Pt1-DATA'!$C:$C,0),0)","v":0},{"$f":"IFERROR(MATCH($A243&\"#\"&S$1,'[1]Pt1-DATA'!$C:$C,0),0)","v":0},{"$f":"IFERROR(MATCH($A243&\"#\"&T$1,'[1]Pt1-DATA'!$C:$C,0),0)","v":0}]
[212,"Large Commercial Aircraft","Twin Aisle","A330","Airbus A330-200","General Electric CF6-80E1","wide body (non IMA)",null,true,null,{"$f":"IFERROR(MATCH($A244&\"#\"&K$1,'[1]Pt1-DATA'!$C:$C,0),0)","v":434},null,{"$f":"IFERROR(MATCH($A244&\"#\"&M$1,'[1]Pt1-DATA'!$C:$C,0),0)","v":0},{"$f":"IFERROR(MATCH($A244&\"#\"&N$1,'[1]Pt1-DATA'!$C:$C,0),0)","v":0},{"$f":"IFERROR(MATCH($A244&\"#\"&O$1,'[1]Pt1-DATA'!$C:$C,0),0)","v":0},{"$f":"IFERROR(MATCH($A244&\"#\"&P$1,'[1]Pt1-DATA'!$C:$C,0),0)","v":0},{"$f":"IFERROR(MATCH($A244&\"#\"&Q$1,'[1]Pt1-DATA'!$C:$C,0),0)","v":0},{"$f":"IFERROR(MATCH($A244&\"#\"&R$1,'[1]Pt1-DATA'!$C:$C,0),0)","v":0},{"$f":"IFERROR(MATCH($A244&\"#\"&S$1,'[1]Pt1-DATA'!$C:$C,0),0)","v":0},{"$f":"IFERROR(MATCH($A244&\"#\"&T$1,'[1]Pt1-DATA'!$C:$C,0),0)","v":11673}]
[516,"Large Commercial Aircraft","Twin Aisle","A330","Airbus A330-200","Pratt & Whitney PW4000-100","wide body (non IMA)",null,true,null,{"$f":"IFERROR(MATCH($A245&\"#\"&K$1,'[1]Pt1-DATA'!$C:$C,0),0)","v":435},null,{"$f":"IFERROR(MATCH($A245&\"#\"&M$1,'[1]Pt1-DATA'!$C:$C,0),0)","v":0},{"$f":"IFERROR(MATCH($A245&\"#\"&N$1,'[1]Pt1-DATA'!$C:$C,0),0)","v":0},{"$f":"IFERROR(MATCH($A245&\"#\"&O$1,'[1]Pt1-DATA'!$C:$C,0),0)","v":0},{"$f":"IFERROR(MATCH($A245&\"#\"&P$1,'[1]Pt1-DATA'!$C:$C,0),0)","v":0},{"$f":"IFERROR(MATCH($A245&\"#\"&Q$1,'[1]Pt1-DATA'!$C:$C,0),0)","v":0},{"$f":"IFERROR(MATCH($A245&\"#\"&R$1,'[1]Pt1-DATA'!$C:$C,0),0)","v":0},{"$f":"IFERROR(MATCH($A245&\"#\"&S$1,'[1]Pt1-DATA'!$C:$C,0),0)","v":0},{"$f":"IFERROR(MATCH($A245&\"#\"&T$1,'[1]Pt1-DATA'!$C:$C,0),0)","v":11674}]
[517,"Large Commercial Aircraft","Twin Aisle","A330","Airbus A330-200","Rolls-Royce Trent 700","wide body (non IMA)",null,true,null,{"$f":"IFERROR(MATCH($A246&\"#\"&K$1,'[1]Pt1-DATA'!$C:$C,0),0)","v":436},null,{"$f":"IFERROR(MATCH($A246&\"#\"&M$1,'[1]Pt1-DATA'!$C:$C,0),0)","v":0},{"$f":"IFERROR(MATCH($A246&\"#\"&N$1,'[1]Pt1-DATA'!$C:$C,0),0)","v":0},{"$f":"IFERROR(MATCH($A246&\"#\"&O$1,'[1]Pt1-DATA'!$C:$C,0),0)","v":0},{"$f":"IFERROR(MATCH($A246&\"#\"&P$1,'[1]Pt1-DATA'!$C:$C,0),0)","v":0},{"$f":"IFERROR(MATCH($A246&\"#\"&Q$1,'[1]Pt1-DATA'!$C:$C,0),0)","v":0},{"$f":"IFERROR(MATCH($A246&\"#\"&R$1,'[1]Pt1-DATA'!$C:$C,0),0)","v":0},{"$f":"IFERROR(MATCH($A246&\"#\"&S$1,'[1]Pt1-DATA'!$C:$C,0),0)","v":0},{"$f":"IFERROR(MATCH($A246&\"#\"&T$1,'[1]Pt1-DATA'!$C:$C,0),0)","v":11675}]
[213,"Large Commercial Aircraft","Twin Aisle","A330","Airbus A330-300","General Electric CF6-80E1","wide body (non IMA)",null,true,null,{"$f":"IFERROR(MATCH($A247&\"#\"&K$1,'[1]Pt1-DATA'!$C:$C,0),0)","v":437},null,{"$f":"IFERROR(MATCH($A247&\"#\"&M$1,'[1]Pt1-DATA'!$C:$C,0),0)","v":0},{"$f":"IFERROR(MATCH($A247&\"#\"&N$1,'[1]Pt1-DATA'!$C:$C,0),0)","v":0},{"$f":"IFERROR(MATCH($A247&\"#\"&O$1,'[1]Pt1-DATA'!$C:$C,0),0)","v":0},{"$f":"IFERROR(MATCH($A247&\"#\"&P$1,'[1]Pt1-DATA'!$C:$C,0),0)","v":0},{"$f":"IFERROR(MATCH($A247&\"#\"&Q$1,'[1]Pt1-DATA'!$C:$C,0),0)","v":0},{"$f":"IFERROR(MATCH($A247&\"#\"&R$1,'[1]Pt1-DATA'!$C:$C,0),0)","v":0},{"$f":"IFERROR(MATCH($A247&\"#\"&S$1,'[1]Pt1-DATA'!$C:$C,0),0)","v":0},{"$f":"IFERROR(MATCH($A247&\"#\"&T$1,'[1]Pt1-DATA'!$C:$C,0),0)","v":11676}]
[518,"Large Commercial Aircraft","Twin Aisle","A330","Airbus A330-300","Pratt & Whitney PW4000-100","wide body (non IMA)",null,true,"J1 - 50000",{"$f":"IFERROR(MATCH($A248&\"#\"&K$1,'[1]Pt1-DATA'!$C:$C,0),0)","v":400},null,{"$f":"IFERROR(MATCH($A248&\"#\"&M$1,'[1]Pt1-DATA'!$C:$C,0),0)","v":0},{"$f":"IFERROR(MATCH($A248&\"#\"&N$1,'[1]Pt1-DATA'!$C:$C,0),0)","v":0},{"$f":"IFERROR(MATCH($A248&\"#\"&O$1,'[1]Pt1-DATA'!$C:$C,0),0)","v":0},{"$f":"IFERROR(MATCH($A248&\"#\"&P$1,'[1]Pt1-DATA'!$C:$C,0),0)","v":0},{"$f":"IFERROR(MATCH($A248&\"#\"&Q$1,'[1]Pt1-DATA'!$C:$C,0),0)","v":0},{"$f":"IFERROR(MATCH($A248&\"#\"&R$1,'[1]Pt1-DATA'!$C:$C,0),0)","v":0},{"$f":"IFERROR(MATCH($A248&\"#\"&S$1,'[1]Pt1-DATA'!$C:$C,0),0)","v":0},{"$f":"IFERROR(MATCH($A248&\"#\"&T$1,'[1]Pt1-DATA'!$C:$C,0),0)","v":11664}]
[519,"Large Commercial Aircraft","Twin Aisle","A330","Airbus A330-300","Rolls-Royce Trent 700","wide body (non IMA)",null,true,null,{"$f":"IFERROR(MATCH($A249&\"#\"&K$1,'[1]Pt1-DATA'!$C:$C,0),0)","v":401},null,{"$f":"IFERROR(MATCH($A249&\"#\"&M$1,'[1]Pt1-DATA'!$C:$C,0),0)","v":0},{"$f":"IFERROR(MATCH($A249&\"#\"&N$1,'[1]Pt1-DATA'!$C:$C,0),0)","v":0},{"$f":"IFERROR(MATCH($A249&\"#\"&O$1,'[1]Pt1-DATA'!$C:$C,0),0)","v":0},{"$f":"IFERROR(MATCH($A249&\"#\"&P$1,'[1]Pt1-DATA'!$C:$C,0),0)","v":0},{"$f":"IFERROR(MATCH($A249&\"#\"&Q$1,'[1]Pt1-DATA'!$C:$C,0),0)","v":0},{"$f":"IFERROR(MATCH($A249&\"#\"&R$1,'[1]Pt1-DATA'!$C:$C,0),0)","v":0},{"$f":"IFERROR(MATCH($A249&\"#\"&S$1,'[1]Pt1-DATA'!$C:$C,0),0)","v":0},{"$f":"IFERROR(MATCH($A249&\"#\"&T$1,'[1]Pt1-DATA'!$C:$C,0),0)","v":11665}]
[214,"Large Commercial Aircraft","Twin Aisle","A330","Airbus A330-800neo","Rolls-Royce Trent 7000","wide body (non IMA)",null,true,null,{"$f":"IFERROR(MATCH($A250&\"#\"&K$1,'[1]Pt1-DATA'!$C:$C,0),0)","v":402},null,{"$f":"IFERROR(MATCH($A250&\"#\"&M$1,'[1]Pt1-DATA'!$C:$C,0),0)","v":0},{"$f":"IFERROR(MATCH($A250&\"#\"&N$1,'[1]Pt1-DATA'!$C:$C,0),0)","v":0},{"$f":"IFERROR(MATCH($A250&\"#\"&O$1,'[1]Pt1-DATA'!$C:$C,0),0)","v":0},{"$f":"IFERROR(MATCH($A250&\"#\"&P$1,'[1]Pt1-DATA'!$C:$C,0),0)","v":0},{"$f":"IFERROR(MATCH($A250&\"#\"&Q$1,'[1]Pt1-DATA'!$C:$C,0),0)","v":0},{"$f":"IFERROR(MATCH($A250&\"#\"&R$1,'[1]Pt1-DATA'!$C:$C,0),0)","v":0},{"$f":"IFERROR(MATCH($A250&\"#\"&S$1,'[1]Pt1-DATA'!$C:$C,0),0)","v":0},{"$f":"IFERROR(MATCH($A250&\"#\"&T$1,'[1]Pt1-DATA'!$C:$C,0),0)","v":11666}]
[215,"Large Commercial Aircraft","Twin Aisle","A330","Airbus A330-900neo","Rolls-Royce Trent 7000","wide body (non IMA)",null,true,null,{"$f":"IFERROR(MATCH($A251&\"#\"&K$1,'[1]Pt1-DATA'!$C:$C,0),0)","v":403},null,{"$f":"IFERROR(MATCH($A251&\"#\"&M$1,'[1]Pt1-DATA'!$C:$C,0),0)","v":0},{"$f":"IFERROR(MATCH($A251&\"#\"&N$1,'[1]Pt1-DATA'!$C:$C,0),0)","v":0},{"$f":"IFERROR(MATCH($A251&\"#\"&O$1,'[1]Pt1-DATA'!$C:$C,0),0)","v":0},{"$f":"IFERROR(MATCH($A251&\"#\"&P$1,'[1]Pt1-DATA'!$C:$C,0),0)","v":0},{"$f":"IFERROR(MATCH($A251&\"#\"&Q$1,'[1]Pt1-DATA'!$C:$C,0),0)","v":0},{"$f":"IFERROR(MATCH($A251&\"#\"&R$1,'[1]Pt1-DATA'!$C:$C,0),0)","v":0},{"$f":"IFERROR(MATCH($A251&\"#\"&S$1,'[1]Pt1-DATA'!$C:$C,0),0)","v":0},{"$f":"IFERROR(MATCH($A251&\"#\"&T$1,'[1]Pt1-DATA'!$C:$C,0),0)","v":11667}]
[304,"Large Commercial Aircraft","Twin Aisle","A340","Airbus A340-200/300","CFM International CFM56 - CFM56-5C","wide body (non IMA)",null,true,null,{"$f":"IFERROR(MATCH($A252&\"#\"&K$1,'[1]Pt1-DATA'!$C:$C,0),0)","v":404},null,{"$f":"IFERROR(MATCH($A252&\"#\"&M$1,'[1]Pt1-DATA'!$C:$C,0),0)","v":0},{"$f":"IFERROR(MATCH($A252&\"#\"&N$1,'[1]Pt1-DATA'!$C:$C,0),0)","v":0},{"$f":"IFERROR(MATCH($A252&\"#\"&O$1,'[1]Pt1-DATA'!$C:$C,0),0)","v":0},{"$f":"IFERROR(MATCH($A252&\"#\"&P$1,'[1]Pt1-DATA'!$C:$C,0),0)","v":0},{"$f":"IFERROR(MATCH($A252&\"#\"&Q$1,'[1]Pt1-DATA'!$C:$C,0),0)","v":0},{"$f":"IFERROR(MATCH($A252&\"#\"&R$1,'[1]Pt1-DATA'!$C:$C,0),0)","v":0},{"$f":"IFERROR(MATCH($A252&\"#\"&S$1,'[1]Pt1-DATA'!$C:$C,0),0)","v":0},{"$f":"IFERROR(MATCH($A252&\"#\"&T$1,'[1]Pt1-DATA'!$C:$C,0),0)","v":11617}]
[5,"Large Commercial Aircraft","Twin Aisle","A340","Airbus A340-500/600","Rolls-Royce Trent 500","wide body (non IMA)",null,true,null,{"$f":"IFERROR(MATCH($A253&\"#\"&K$1,'[1]Pt1-DATA'!$C:$C,0),0)","v":405},null,{"$f":"IFERROR(MATCH($A253&\"#\"&M$1,'[1]Pt1-DATA'!$C:$C,0),0)","v":0},{"$f":"IFERROR(MATCH($A253&\"#\"&N$1,'[1]Pt1-DATA'!$C:$C,0),0)","v":0},{"$f":"IFERROR(MATCH($A253&\"#\"&O$1,'[1]Pt1-DATA'!$C:$C,0),0)","v":0},{"$f":"IFERROR(MATCH($A253&\"#\"&P$1,'[1]Pt1-DATA'!$C:$C,0),0)","v":0},{"$f":"IFERROR(MATCH($A253&\"#\"&Q$1,'[1]Pt1-DATA'!$C:$C,0),0)","v":0},{"$f":"IFERROR(MATCH($A253&\"#\"&R$1,'[1]Pt1-DATA'!$C:$C,0),0)","v":0},{"$f":"IFERROR(MATCH($A253&\"#\"&S$1,'[1]Pt1-DATA'!$C:$C,0),0)","v":0},{"$f":"IFERROR(MATCH($A253&\"#\"&T$1,'[1]Pt1-DATA'!$C:$C,0),0)","v":11618}]
[6,"Large Commercial Aircraft","Twin Aisle","A350","Airbus A350 XWB - A350-900","Rolls-Royce Trent XWB-84","wide body (IMA)",null,true,null,{"$f":"IFERROR(MATCH($A254&\"#\"&K$1,'[1]Pt1-DATA'!$C:$C,0),0)","v":406},null,{"$f":"IFERROR(MATCH($A254&\"#\"&M$1,'[1]Pt1-DATA'!$C:$C,0),0)","v":0},{"$f":"IFERROR(MATCH($A254&\"#\"&N$1,'[1]Pt1-DATA'!$C:$C,0),0)","v":7408},{"$f":"IFERROR(MATCH($A254&\"#\"&O$1,'[1]Pt1-DATA'!$C:$C,0),0)","v":7625},{"$f":"IFERROR(MATCH($A254&\"#\"&P$1,'[1]Pt1-DATA'!$C:$C,0),0)","v":0},{"$f":"IFERROR(MATCH($A254&\"#\"&Q$1,'[1]Pt1-DATA'!$C:$C,0),0)","v":0},{"$f":"IFERROR(MATCH($A254&\"#\"&R$1,'[1]Pt1-DATA'!$C:$C,0),0)","v":0},{"$f":"IFERROR(MATCH($A254&\"#\"&S$1,'[1]Pt1-DATA'!$C:$C,0),0)","v":0},{"$f":"IFERROR(MATCH($A254&\"#\"&T$1,'[1]Pt1-DATA'!$C:$C,0),0)","v":0}]
[7,"Large Commercial Aircraft","Twin Aisle","A350","Airbus A350-1000","Rolls-Royce Trent XWB-97","wide body (IMA)",null,true,null,{"$f":"IFERROR(MATCH($A255&\"#\"&K$1,'[1]Pt1-DATA'!$C:$C,0),0)","v":407},null,{"$f":"IFERROR(MATCH($A255&\"#\"&M$1,'[1]Pt1-DATA'!$C:$C,0),0)","v":0},{"$f":"IFERROR(MATCH($A255&\"#\"&N$1,'[1]Pt1-DATA'!$C:$C,0),0)","v":7409},{"$f":"IFERROR(MATCH($A255&\"#\"&O$1,'[1]Pt1-DATA'!$C:$C,0),0)","v":7626},{"$f":"IFERROR(MATCH($A255&\"#\"&P$1,'[1]Pt1-DATA'!$C:$C,0),0)","v":0},{"$f":"IFERROR(MATCH($A255&\"#\"&Q$1,'[1]Pt1-DATA'!$C:$C,0),0)","v":0},{"$f":"IFERROR(MATCH($A255&\"#\"&R$1,'[1]Pt1-DATA'!$C:$C,0),0)","v":0},{"$f":"IFERROR(MATCH($A255&\"#\"&S$1,'[1]Pt1-DATA'!$C:$C,0),0)","v":0},{"$f":"IFERROR(MATCH($A255&\"#\"&T$1,'[1]Pt1-DATA'!$C:$C,0),0)","v":0}]
[657,"Large Commercial Aircraft","Twin Aisle","A350","Airbus A350-1000neo","Rolls-Royce UltraFan","wide body (IMA)",null,true,null,{"$f":"IFERROR(MATCH($A256&\"#\"&K$1,'[1]Pt1-DATA'!$C:$C,0),0)","v":408},null,{"$f":"IFERROR(MATCH($A256&\"#\"&M$1,'[1]Pt1-DATA'!$C:$C,0),0)","v":0},{"$f":"IFERROR(MATCH($A256&\"#\"&N$1,'[1]Pt1-DATA'!$C:$C,0),0)","v":7410},{"$f":"IFERROR(MATCH($A256&\"#\"&O$1,'[1]Pt1-DATA'!$C:$C,0),0)","v":7627},{"$f":"IFERROR(MATCH($A256&\"#\"&P$1,'[1]Pt1-DATA'!$C:$C,0),0)","v":0},{"$f":"IFERROR(MATCH($A256&\"#\"&Q$1,'[1]Pt1-DATA'!$C:$C,0),0)","v":0},{"$f":"IFERROR(MATCH($A256&\"#\"&R$1,'[1]Pt1-DATA'!$C:$C,0),0)","v":0},{"$f":"IFERROR(MATCH($A256&\"#\"&S$1,'[1]Pt1-DATA'!$C:$C,0),0)","v":0},{"$f":"IFERROR(MATCH($A256&\"#\"&T$1,'[1]Pt1-DATA'!$C:$C,0),0)","v":0}]
[656,"Large Commercial Aircraft","Twin Aisle","A350","Airbus A350-900neo","Rolls-Royce UltraFan","wide body (IMA)",null,true,null,{"$f":"IFERROR(MATCH($A257&\"#\"&K$1,'[1]Pt1-DATA'!$C:$C,0),0)","v":409},null,{"$f":"IFERROR(MATCH($A257&\"#\"&M$1,'[1]Pt1-DATA'!$C:$C,0),0)","v":0},{"$f":"IFERROR(MATCH($A257&\"#\"&N$1,'[1]Pt1-DATA'!$C:$C,0),0)","v":7411},{"$f":"IFERROR(MATCH($A257&\"#\"&O$1,'[1]Pt1-DATA'!$C:$C,0),0)","v":7628},{"$f":"IFERROR(MATCH($A257&\"#\"&P$1,'[1]Pt1-DATA'!$C:$C,0),0)","v":0},{"$f":"IFERROR(MATCH($A257&\"#\"&Q$1,'[1]Pt1-DATA'!$C:$C,0),0)","v":0},{"$f":"IFERROR(MATCH($A257&\"#\"&R$1,'[1]Pt1-DATA'!$C:$C,0),0)","v":0},{"$f":"IFERROR(MATCH($A257&\"#\"&S$1,'[1]Pt1-DATA'!$C:$C,0),0)","v":0},{"$f":"IFERROR(MATCH($A257&\"#\"&T$1,'[1]Pt1-DATA'!$C:$C,0),0)","v":0}]
[305,"Large Commercial Aircraft","Twin Aisle","Airbus A300","Airbus A300","General Electric CF6-80A2","wide body (non IMA)",null,true,null,{"$f":"IFERROR(MATCH($A258&\"#\"&K$1,'[1]Pt1-DATA'!$C:$C,0),0)","v":410},null,{"$f":"IFERROR(MATCH($A258&\"#\"&M$1,'[1]Pt1-DATA'!$C:$C,0),0)","v":0},{"$f":"IFERROR(MATCH($A258&\"#\"&N$1,'[1]Pt1-DATA'!$C:$C,0),0)","v":0},{"$f":"IFERROR(MATCH($A258&\"#\"&O$1,'[1]Pt1-DATA'!$C:$C,0),0)","v":0},{"$f":"IFERROR(MATCH($A258&\"#\"&P$1,'[1]Pt1-DATA'!$C:$C,0),0)","v":0},{"$f":"IFERROR(MATCH($A258&\"#\"&Q$1,'[1]Pt1-DATA'!$C:$C,0),0)","v":0},{"$f":"IFERROR(MATCH($A258&\"#\"&R$1,'[1]Pt1-DATA'!$C:$C,0),0)","v":0},{"$f":"IFERROR(MATCH($A258&\"#\"&S$1,'[1]Pt1-DATA'!$C:$C,0),0)","v":0},{"$f":"IFERROR(MATCH($A258&\"#\"&T$1,'[1]Pt1-DATA'!$C:$C,0),0)","v":11619}]
[532,"Large Commercial Aircraft","Twin Aisle","Airbus A300","Airbus A300","Pratt & Whitney PW4000-94","wide body (non IMA)",null,{"$f":"SUM(K259:T259)>0","v":true},null,{"$f":"IFERROR(MATCH($A259&\"#\"&K$1,'[1]Pt1-DATA'!$C:$C,0),0)","v":411},null,{"$f":"IFERROR(MATCH($A259&\"#\"&M$1,'[1]Pt1-DATA'!$C:$C,0),0)","v":0},{"$f":"IFERROR(MATCH($A259&\"#\"&N$1,'[1]Pt1-DATA'!$C:$C,0),0)","v":0},{"$f":"IFERROR(MATCH($A259&\"#\"&O$1,'[1]Pt1-DATA'!$C:$C,0),0)","v":0},{"$f":"IFERROR(MATCH($A259&\"#\"&P$1,'[1]Pt1-DATA'!$C:$C,0),0)","v":0},{"$f":"IFERROR(MATCH($A259&\"#\"&Q$1,'[1]Pt1-DATA'!$C:$C,0),0)","v":0},{"$f":"IFERROR(MATCH($A259&\"#\"&R$1,'[1]Pt1-DATA'!$C:$C,0),0)","v":0},{"$f":"IFERROR(MATCH($A259&\"#\"&S$1,'[1]Pt1-DATA'!$C:$C,0),0)","v":0},{"$f":"IFERROR(MATCH($A259&\"#\"&T$1,'[1]Pt1-DATA'!$C:$C,0),0)","v":11620}]
[12,"Large Commercial Aircraft","Twin Aisle","Boeing 767","Boeing 767","General Electric CF6-80C2","wide body (non IMA)",null,true,null,{"$f":"IFERROR(MATCH($A260&\"#\"&K$1,'[1]Pt1-DATA'!$C:$C,0),0)","v":412},null,{"$f":"IFERROR(MATCH($A260&\"#\"&M$1,'[1]Pt1-DATA'!$C:$C,0),0)","v":0},{"$f":"IFERROR(MATCH($A260&\"#\"&N$1,'[1]Pt1-DATA'!$C:$C,0),0)","v":0},{"$f":"IFERROR(MATCH($A260&\"#\"&O$1,'[1]Pt1-DATA'!$C:$C,0),0)","v":0},{"$f":"IFERROR(MATCH($A260&\"#\"&P$1,'[1]Pt1-DATA'!$C:$C,0),0)","v":0},{"$f":"IFERROR(MATCH($A260&\"#\"&Q$1,'[1]Pt1-DATA'!$C:$C,0),0)","v":0},{"$f":"IFERROR(MATCH($A260&\"#\"&R$1,'[1]Pt1-DATA'!$C:$C,0),0)","v":0},{"$f":"IFERROR(MATCH($A260&\"#\"&S$1,'[1]Pt1-DATA'!$C:$C,0),0)","v":0},{"$f":"IFERROR(MATCH($A260&\"#\"&T$1,'[1]Pt1-DATA'!$C:$C,0),0)","v":11621}]
[537,"Large Commercial Aircraft","Twin Aisle","Boeing 767","Boeing 767","Pratt & Whitney PW4000-94","wide body (non IMA)",null,true,null,{"$f":"IFERROR(MATCH($A261&\"#\"&K$1,'[1]Pt1-DATA'!$C:$C,0),0)","v":413},null,{"$f":"IFERROR(MATCH($A261&\"#\"&M$1,'[1]Pt1-DATA'!$C:$C,0),0)","v":0},{"$f":"IFERROR(MATCH($A261&\"#\"&N$1,'[1]Pt1-DATA'!$C:$C,0),0)","v":0},{"$f":"IFERROR(MATCH($A261&\"#\"&O$1,'[1]Pt1-DATA'!$C:$C,0),0)","v":0},{"$f":"IFERROR(MATCH($A261&\"#\"&P$1,'[1]Pt1-DATA'!$C:$C,0),0)","v":0},{"$f":"IFERROR(MATCH($A261&\"#\"&Q$1,'[1]Pt1-DATA'!$C:$C,0),0)","v":0},{"$f":"IFERROR(MATCH($A261&\"#\"&R$1,'[1]Pt1-DATA'!$C:$C,0),0)","v":0},{"$f":"IFERROR(MATCH($A261&\"#\"&S$1,'[1]Pt1-DATA'!$C:$C,0),0)","v":0},{"$f":"IFERROR(MATCH($A261&\"#\"&T$1,'[1]Pt1-DATA'!$C:$C,0),0)","v":11622}]
[538,"Large Commercial Aircraft","Twin Aisle","Boeing 767","Boeing 767","Rolls-Royce RB211-524G/H &T","wide body (non IMA)",null,true,null,{"$f":"IFERROR(MATCH($A262&\"#\"&K$1,'[1]Pt1-DATA'!$C:$C,0),0)","v":414},null,{"$f":"IFERROR(MATCH($A262&\"#\"&M$1,'[1]Pt1-DATA'!$C:$C,0),0)","v":0},{"$f":"IFERROR(MATCH($A262&\"#\"&N$1,'[1]Pt1-DATA'!$C:$C,0),0)","v":0},{"$f":"IFERROR(MATCH($A262&\"#\"&O$1,'[1]Pt1-DATA'!$C:$C,0),0)","v":0},{"$f":"IFERROR(MATCH($A262&\"#\"&P$1,'[1]Pt1-DATA'!$C:$C,0),0)","v":0},{"$f":"IFERROR(MATCH($A262&\"#\"&Q$1,'[1]Pt1-DATA'!$C:$C,0),0)","v":0},{"$f":"IFERROR(MATCH($A262&\"#\"&R$1,'[1]Pt1-DATA'!$C:$C,0),0)","v":0},{"$f":"IFERROR(MATCH($A262&\"#\"&S$1,'[1]Pt1-DATA'!$C:$C,0),0)","v":0},{"$f":"IFERROR(MATCH($A262&\"#\"&T$1,'[1]Pt1-DATA'!$C:$C,0),0)","v":11623}]
[539,"Large Commercial Aircraft","Twin Aisle","Boeing 777","Boeing 777: 777-200ER","General Electric GE90-94B","wide body (IMA)",null,true,null,{"$f":"IFERROR(MATCH($A263&\"#\"&K$1,'[1]Pt1-DATA'!$C:$C,0),0)","v":415},null,{"$f":"IFERROR(MATCH($A263&\"#\"&M$1,'[1]Pt1-DATA'!$C:$C,0),0)","v":0},{"$f":"IFERROR(MATCH($A263&\"#\"&N$1,'[1]Pt1-DATA'!$C:$C,0),0)","v":0},{"$f":"IFERROR(MATCH($A263&\"#\"&O$1,'[1]Pt1-DATA'!$C:$C,0),0)","v":0},{"$f":"IFERROR(MATCH($A263&\"#\"&P$1,'[1]Pt1-DATA'!$C:$C,0),0)","v":0},{"$f":"IFERROR(MATCH($A263&\"#\"&Q$1,'[1]Pt1-DATA'!$C:$C,0),0)","v":0},{"$f":"IFERROR(MATCH($A263&\"#\"&R$1,'[1]Pt1-DATA'!$C:$C,0),0)","v":0},{"$f":"IFERROR(MATCH($A263&\"#\"&S$1,'[1]Pt1-DATA'!$C:$C,0),0)","v":0},{"$f":"IFERROR(MATCH($A263&\"#\"&T$1,'[1]Pt1-DATA'!$C:$C,0),0)","v":11668}]
[302,"Large Commercial Aircraft","Twin Aisle","Boeing 777","Boeing 777: 777-200ER","Pratt & Whitney PW4000-112","wide body (IMA)",null,true,null,{"$f":"IFERROR(MATCH($A264&\"#\"&K$1,'[1]Pt1-DATA'!$C:$C,0),0)","v":416},null,{"$f":"IFERROR(MATCH($A264&\"#\"&M$1,'[1]Pt1-DATA'!$C:$C,0),0)","v":0},{"$f":"IFERROR(MATCH($A264&\"#\"&N$1,'[1]Pt1-DATA'!$C:$C,0),0)","v":0},{"$f":"IFERROR(MATCH($A264&\"#\"&O$1,'[1]Pt1-DATA'!$C:$C,0),0)","v":0},{"$f":"IFERROR(MATCH($A264&\"#\"&P$1,'[1]Pt1-DATA'!$C:$C,0),0)","v":0},{"$f":"IFERROR(MATCH($A264&\"#\"&Q$1,'[1]Pt1-DATA'!$C:$C,0),0)","v":0},{"$f":"IFERROR(MATCH($A264&\"#\"&R$1,'[1]Pt1-DATA'!$C:$C,0),0)","v":0},{"$f":"IFERROR(MATCH($A264&\"#\"&S$1,'[1]Pt1-DATA'!$C:$C,0),0)","v":0},{"$f":"IFERROR(MATCH($A264&\"#\"&T$1,'[1]Pt1-DATA'!$C:$C,0),0)","v":11669}]
[579,"Large Commercial Aircraft","Twin Aisle","Boeing 777","Boeing 777: 777-200ER","Rolls-Royce Trent 800","wide body (IMA)",null,true,null,{"$f":"IFERROR(MATCH($A265&\"#\"&K$1,'[1]Pt1-DATA'!$C:$C,0),0)","v":417},null,{"$f":"IFERROR(MATCH($A265&\"#\"&M$1,'[1]Pt1-DATA'!$C:$C,0),0)","v":0},{"$f":"IFERROR(MATCH($A265&\"#\"&N$1,'[1]Pt1-DATA'!$C:$C,0),0)","v":0},{"$f":"IFERROR(MATCH($A265&\"#\"&O$1,'[1]Pt1-DATA'!$C:$C,0),0)","v":0},{"$f":"IFERROR(MATCH($A265&\"#\"&P$1,'[1]Pt1-DATA'!$C:$C,0),0)","v":0},{"$f":"IFERROR(MATCH($A265&\"#\"&Q$1,'[1]Pt1-DATA'!$C:$C,0),0)","v":0},{"$f":"IFERROR(MATCH($A265&\"#\"&R$1,'[1]Pt1-DATA'!$C:$C,0),0)","v":0},{"$f":"IFERROR(MATCH($A265&\"#\"&S$1,'[1]Pt1-DATA'!$C:$C,0),0)","v":0},{"$f":"IFERROR(MATCH($A265&\"#\"&T$1,'[1]Pt1-DATA'!$C:$C,0),0)","v":11670}]
[201,"Large Commercial Aircraft","Twin Aisle","Boeing 777","Boeing 777: 777-200LR","General Electric GE90-115B","wide body (IMA)",null,true,null,{"$f":"IFERROR(MATCH($A266&\"#\"&K$1,'[1]Pt1-DATA'!$C:$C,0),0)","v":418},null,{"$f":"IFERROR(MATCH($A266&\"#\"&M$1,'[1]Pt1-DATA'!$C:$C,0),0)","v":0},{"$f":"IFERROR(MATCH($A266&\"#\"&N$1,'[1]Pt1-DATA'!$C:$C,0),0)","v":7412},{"$f":"IFERROR(MATCH($A266&\"#\"&O$1,'[1]Pt1-DATA'!$C:$C,0),0)","v":7629},{"$f":"IFERROR(MATCH($A266&\"#\"&P$1,'[1]Pt1-DATA'!$C:$C,0),0)","v":0},{"$f":"IFERROR(MATCH($A266&\"#\"&Q$1,'[1]Pt1-DATA'!$C:$C,0),0)","v":0},{"$f":"IFERROR(MATCH($A266&\"#\"&R$1,'[1]Pt1-DATA'!$C:$C,0),0)","v":0},{"$f":"IFERROR(MATCH($A266&\"#\"&S$1,'[1]Pt1-DATA'!$C:$C,0),0)","v":0},{"$f":"IFERROR(MATCH($A266&\"#\"&T$1,'[1]Pt1-DATA'!$C:$C,0),0)","v":0}]
[303,"Large Commercial Aircraft","Twin Aisle","Boeing 777","Boeing 777: 777-300","Pratt & Whitney PW4000-112","wide body (IMA)",null,true,null,{"$f":"IFERROR(MATCH($A267&\"#\"&K$1,'[1]Pt1-DATA'!$C:$C,0),0)","v":419},null,{"$f":"IFERROR(MATCH($A267&\"#\"&M$1,'[1]Pt1-DATA'!$C:$C,0),0)","v":0},{"$f":"IFERROR(MATCH($A267&\"#\"&N$1,'[1]Pt1-DATA'!$C:$C,0),0)","v":0},{"$f":"IFERROR(MATCH($A267&\"#\"&O$1,'[1]Pt1-DATA'!$C:$C,0),0)","v":0},{"$f":"IFERROR(MATCH($A267&\"#\"&P$1,'[1]Pt1-DATA'!$C:$C,0),0)","v":0},{"$f":"IFERROR(MATCH($A267&\"#\"&Q$1,'[1]Pt1-DATA'!$C:$C,0),0)","v":0},{"$f":"IFERROR(MATCH($A267&\"#\"&R$1,'[1]Pt1-DATA'!$C:$C,0),0)","v":0},{"$f":"IFERROR(MATCH($A267&\"#\"&S$1,'[1]Pt1-DATA'!$C:$C,0),0)","v":0},{"$f":"IFERROR(MATCH($A267&\"#\"&T$1,'[1]Pt1-DATA'!$C:$C,0),0)","v":11671}]
[597,"Large Commercial Aircraft","Twin Aisle","Boeing 777","Boeing 777: 777-300","Rolls-Royce Trent 800","wide body (IMA)",null,true,null,{"$f":"IFERROR(MATCH($A268&\"#\"&K$1,'[1]Pt1-DATA'!$C:$C,0),0)","v":420},null,{"$f":"IFERROR(MATCH($A268&\"#\"&M$1,'[1]Pt1-DATA'!$C:$C,0),0)","v":0},{"$f":"IFERROR(MATCH($A268&\"#\"&N$1,'[1]Pt1-DATA'!$C:$C,0),0)","v":0},{"$f":"IFERROR(MATCH($A268&\"#\"&O$1,'[1]Pt1-DATA'!$C:$C,0),0)","v":0},{"$f":"IFERROR(MATCH($A268&\"#\"&P$1,'[1]Pt1-DATA'!$C:$C,0),0)","v":0},{"$f":"IFERROR(MATCH($A268&\"#\"&Q$1,'[1]Pt1-DATA'!$C:$C,0),0)","v":0},{"$f":"IFERROR(MATCH($A268&\"#\"&R$1,'[1]Pt1-DATA'!$C:$C,0),0)","v":0},{"$f":"IFERROR(MATCH($A268&\"#\"&S$1,'[1]Pt1-DATA'!$C:$C,0),0)","v":0},{"$f":"IFERROR(MATCH($A268&\"#\"&T$1,'[1]Pt1-DATA'!$C:$C,0),0)","v":11672}]
[202,"Large Commercial Aircraft","Twin Aisle","Boeing 777","Boeing 777: 777-300ER","General Electric GE90-115B","wide body (IMA)",null,true,null,{"$f":"IFERROR(MATCH($A269&\"#\"&K$1,'[1]Pt1-DATA'!$C:$C,0),0)","v":421},null,{"$f":"IFERROR(MATCH($A269&\"#\"&M$1,'[1]Pt1-DATA'!$C:$C,0),0)","v":0},{"$f":"IFERROR(MATCH($A269&\"#\"&N$1,'[1]Pt1-DATA'!$C:$C,0),0)","v":7413},{"$f":"IFERROR(MATCH($A269&\"#\"&O$1,'[1]Pt1-DATA'!$C:$C,0),0)","v":7630},{"$f":"IFERROR(MATCH($A269&\"#\"&P$1,'[1]Pt1-DATA'!$C:$C,0),0)","v":0},{"$f":"IFERROR(MATCH($A269&\"#\"&Q$1,'[1]Pt1-DATA'!$C:$C,0),0)","v":0},{"$f":"IFERROR(MATCH($A269&\"#\"&R$1,'[1]Pt1-DATA'!$C:$C,0),0)","v":0},{"$f":"IFERROR(MATCH($A269&\"#\"&S$1,'[1]Pt1-DATA'!$C:$C,0),0)","v":0},{"$f":"IFERROR(MATCH($A269&\"#\"&T$1,'[1]Pt1-DATA'!$C:$C,0),0)","v":0}]
[203,"Large Commercial Aircraft","Twin Aisle","Boeing 777X","Boeing 777X: 777-8","General Electric GE9X","wide body (IMA)",null,true,null,{"$f":"IFERROR(MATCH($A270&\"#\"&K$1,'[1]Pt1-DATA'!$C:$C,0),0)","v":422},null,{"$f":"IFERROR(MATCH($A270&\"#\"&M$1,'[1]Pt1-DATA'!$C:$C,0),0)","v":0},{"$f":"IFERROR(MATCH($A270&\"#\"&N$1,'[1]Pt1-DATA'!$C:$C,0),0)","v":7414},{"$f":"IFERROR(MATCH($A270&\"#\"&O$1,'[1]Pt1-DATA'!$C:$C,0),0)","v":7631},{"$f":"IFERROR(MATCH($A270&\"#\"&P$1,'[1]Pt1-DATA'!$C:$C,0),0)","v":0},{"$f":"IFERROR(MATCH($A270&\"#\"&Q$1,'[1]Pt1-DATA'!$C:$C,0),0)","v":0},{"$f":"IFERROR(MATCH($A270&\"#\"&R$1,'[1]Pt1-DATA'!$C:$C,0),0)","v":0},{"$f":"IFERROR(MATCH($A270&\"#\"&S$1,'[1]Pt1-DATA'!$C:$C,0),0)","v":0},{"$f":"IFERROR(MATCH($A270&\"#\"&T$1,'[1]Pt1-DATA'!$C:$C,0),0)","v":0}]
[204,"Large Commercial Aircraft","Twin Aisle","Boeing 777X","Boeing 777X: 777-9","General Electric GE9X","wide body (IMA)",null,true,null,{"$f":"IFERROR(MATCH($A271&\"#\"&K$1,'[1]Pt1-DATA'!$C:$C,0),0)","v":423},null,{"$f":"IFERROR(MATCH($A271&\"#\"&M$1,'[1]Pt1-DATA'!$C:$C,0),0)","v":0},{"$f":"IFERROR(MATCH($A271&\"#\"&N$1,'[1]Pt1-DATA'!$C:$C,0),0)","v":7415},{"$f":"IFERROR(MATCH($A271&\"#\"&O$1,'[1]Pt1-DATA'!$C:$C,0),0)","v":7632},{"$f":"IFERROR(MATCH($A271&\"#\"&P$1,'[1]Pt1-DATA'!$C:$C,0),0)","v":0},{"$f":"IFERROR(MATCH($A271&\"#\"&Q$1,'[1]Pt1-DATA'!$C:$C,0),0)","v":0},{"$f":"IFERROR(MATCH($A271&\"#\"&R$1,'[1]Pt1-DATA'!$C:$C,0),0)","v":0},{"$f":"IFERROR(MATCH($A271&\"#\"&S$1,'[1]Pt1-DATA'!$C:$C,0),0)","v":0},{"$f":"IFERROR(MATCH($A271&\"#\"&T$1,'[1]Pt1-DATA'!$C:$C,0),0)","v":0}]
[200,"Large Commercial Aircraft","Twin Aisle","Boeing 787","Boeing 787 Dreamliner: 787-10","General Electric GEnx-1B","wide body (IMA)",null,true,null,{"$f":"IFERROR(MATCH($A272&\"#\"&K$1,'[1]Pt1-DATA'!$C:$C,0),0)","v":424},null,{"$f":"IFERROR(MATCH($A272&\"#\"&M$1,'[1]Pt1-DATA'!$C:$C,0),0)","v":0},{"$f":"IFERROR(MATCH($A272&\"#\"&N$1,'[1]Pt1-DATA'!$C:$C,0),0)","v":7416},{"$f":"IFERROR(MATCH($A272&\"#\"&O$1,'[1]Pt1-DATA'!$C:$C,0),0)","v":7633},{"$f":"IFERROR(MATCH($A272&\"#\"&P$1,'[1]Pt1-DATA'!$C:$C,0),0)","v":0},{"$f":"IFERROR(MATCH($A272&\"#\"&Q$1,'[1]Pt1-DATA'!$C:$C,0),0)","v":0},{"$f":"IFERROR(MATCH($A272&\"#\"&R$1,'[1]Pt1-DATA'!$C:$C,0),0)","v":0},{"$f":"IFERROR(MATCH($A272&\"#\"&S$1,'[1]Pt1-DATA'!$C:$C,0),0)","v":0},{"$f":"IFERROR(MATCH($A272&\"#\"&T$1,'[1]Pt1-DATA'!$C:$C,0),0)","v":0}]
[509,"Large Commercial Aircraft","Twin Aisle","Boeing 787","Boeing 787 Dreamliner: 787-10","Rolls-Royce Trent 1000","wide body (IMA)",null,true,null,{"$f":"IFERROR(MATCH($A273&\"#\"&K$1,'[1]Pt1-DATA'!$C:$C,0),0)","v":425},null,{"$f":"IFERROR(MATCH($A273&\"#\"&M$1,'[1]Pt1-DATA'!$C:$C,0),0)","v":0},{"$f":"IFERROR(MATCH($A273&\"#\"&N$1,'[1]Pt1-DATA'!$C:$C,0),0)","v":7417},{"$f":"IFERROR(MATCH($A273&\"#\"&O$1,'[1]Pt1-DATA'!$C:$C,0),0)","v":7634},{"$f":"IFERROR(MATCH($A273&\"#\"&P$1,'[1]Pt1-DATA'!$C:$C,0),0)","v":0},{"$f":"IFERROR(MATCH($A273&\"#\"&Q$1,'[1]Pt1-DATA'!$C:$C,0),0)","v":0},{"$f":"IFERROR(MATCH($A273&\"#\"&R$1,'[1]Pt1-DATA'!$C:$C,0),0)","v":0},{"$f":"IFERROR(MATCH($A273&\"#\"&S$1,'[1]Pt1-DATA'!$C:$C,0),0)","v":0},{"$f":"IFERROR(MATCH($A273&\"#\"&T$1,'[1]Pt1-DATA'!$C:$C,0),0)","v":0}]
[198,"Large Commercial Aircraft","Twin Aisle","Boeing 787","Boeing 787 Dreamliner: 787-8","General Electric GEnx-1B","wide body (IMA)",null,true,null,{"$f":"IFERROR(MATCH($A274&\"#\"&K$1,'[1]Pt1-DATA'!$C:$C,0),0)","v":426},null,{"$f":"IFERROR(MATCH($A274&\"#\"&M$1,'[1]Pt1-DATA'!$C:$C,0),0)","v":0},{"$f":"IFERROR(MATCH($A274&\"#\"&N$1,'[1]Pt1-DATA'!$C:$C,0),0)","v":7418},{"$f":"IFERROR(MATCH($A274&\"#\"&O$1,'[1]Pt1-DATA'!$C:$C,0),0)","v":7635},{"$f":"IFERROR(MATCH($A274&\"#\"&P$1,'[1]Pt1-DATA'!$C:$C,0),0)","v":0},{"$f":"IFERROR(MATCH($A274&\"#\"&Q$1,'[1]Pt1-DATA'!$C:$C,0),0)","v":0},{"$f":"IFERROR(MATCH($A274&\"#\"&R$1,'[1]Pt1-DATA'!$C:$C,0),0)","v":0},{"$f":"IFERROR(MATCH($A274&\"#\"&S$1,'[1]Pt1-DATA'!$C:$C,0),0)","v":0},{"$f":"IFERROR(MATCH($A274&\"#\"&T$1,'[1]Pt1-DATA'!$C:$C,0),0)","v":0}]
[507,"Large Commercial Aircraft","Twin Aisle","Boeing 787","Boeing 787 Dreamliner: 787-8","Rolls-Royce Trent 1000","wide body (IMA)",null,true,null,{"$f":"IFERROR(MATCH($A275&\"#\"&K$1,'[1]Pt1-DATA'!$C:$C,0),0)","v":427},null,{"$f":"IFERROR(MATCH($A275&\"#\"&M$1,'[1]Pt1-DATA'!$C:$C,0),0)","v":0},{"$f":"IFERROR(MATCH($A275&\"#\"&N$1,'[1]Pt1-DATA'!$C:$C,0),0)","v":7419},{"$f":"IFERROR(MATCH($A275&\"#\"&O$1,'[1]Pt1-DATA'!$C:$C,0),0)","v":7636},{"$f":"IFERROR(MATCH($A275&\"#\"&P$1,'[1]Pt1-DATA'!$C:$C,0),0)","v":0},{"$f":"IFERROR(MATCH($A275&\"#\"&Q$1,'[1]Pt1-DATA'!$C:$C,0),0)","v":0},{"$f":"IFERROR(MATCH($A275&\"#\"&R$1,'[1]Pt1-DATA'!$C:$C,0),0)","v":0},{"$f":"IFERROR(MATCH($A275&\"#\"&S$1,'[1]Pt1-DATA'!$C:$C,0),0)","v":0},{"$f":"IFERROR(MATCH($A275&\"#\"&T$1,'[1]Pt1-DATA'!$C:$C,0),0)","v":0}]
[199,"Large Commercial Aircraft","Twin Aisle","Boeing 787","Boeing 787 Dreamliner: 787-9","General Electric GEnx-1B","wide body (IMA)",null,true,"J - 47000",{"$f":"IFERROR(MATCH($A276&\"#\"&K$1,'[1]Pt1-DATA'!$C:$C,0),0)","v":428},null,{"$f":"IFERROR(MATCH($A276&\"#\"&M$1,'[1]Pt1-DATA'!$C:$C,0),0)","v":0},{"$f":"IFERROR(MATCH($A276&\"#\"&N$1,'[1]Pt1-DATA'!$C:$C,0),0)","v":7420},{"$f":"IFERROR(MATCH($A276&\"#\"&O$1,'[1]Pt1-DATA'!$C:$C,0),0)","v":7637},{"$f":"IFERROR(MATCH($A276&\"#\"&P$1,'[1]Pt1-DATA'!$C:$C,0),0)","v":0},{"$f":"IFERROR(MATCH($A276&\"#\"&Q$1,'[1]Pt1-DATA'!$C:$C,0),0)","v":0},{"$f":"IFERROR(MATCH($A276&\"#\"&R$1,'[1]Pt1-DATA'!$C:$C,0),0)","v":0},{"$f":"IFERROR(MATCH($A276&\"#\"&S$1,'[1]Pt1-DATA'!$C:$C,0),0)","v":0},{"$f":"IFERROR(MATCH($A276&\"#\"&T$1,'[1]Pt1-DATA'!$C:$C,0),0)","v":0}]
[508,"Large Commercial Aircraft","Twin Aisle","Boeing 787","Boeing 787 Dreamliner: 787-9","Rolls-Royce Trent 1000","wide body (IMA)",null,true,null,{"$f":"IFERROR(MATCH($A277&\"#\"&K$1,'[1]Pt1-DATA'!$C:$C,0),0)","v":429},null,{"$f":"IFERROR(MATCH($A277&\"#\"&M$1,'[1]Pt1-DATA'!$C:$C,0),0)","v":0},{"$f":"IFERROR(MATCH($A277&\"#\"&N$1,'[1]Pt1-DATA'!$C:$C,0),0)","v":7421},{"$f":"IFERROR(MATCH($A277&\"#\"&O$1,'[1]Pt1-DATA'!$C:$C,0),0)","v":7638},{"$f":"IFERROR(MATCH($A277&\"#\"&P$1,'[1]Pt1-DATA'!$C:$C,0),0)","v":0},{"$f":"IFERROR(MATCH($A277&\"#\"&Q$1,'[1]Pt1-DATA'!$C:$C,0),0)","v":0},{"$f":"IFERROR(MATCH($A277&\"#\"&R$1,'[1]Pt1-DATA'!$C:$C,0),0)","v":0},{"$f":"IFERROR(MATCH($A277&\"#\"&S$1,'[1]Pt1-DATA'!$C:$C,0),0)","v":0},{"$f":"IFERROR(MATCH($A277&\"#\"&T$1,'[1]Pt1-DATA'!$C:$C,0),0)","v":0}]
[216,"Large Commercial Aircraft","Very large aircraft","A380","Airbus A380","Engine Alliance GP7200","wide body (IMA)",null,true,null,{"$f":"IFERROR(MATCH($A278&\"#\"&K$1,'[1]Pt1-DATA'!$C:$C,0),0)","v":457},null,{"$f":"IFERROR(MATCH($A278&\"#\"&M$1,'[1]Pt1-DATA'!$C:$C,0),0)","v":0},{"$f":"IFERROR(MATCH($A278&\"#\"&N$1,'[1]Pt1-DATA'!$C:$C,0),0)","v":7423},{"$f":"IFERROR(MATCH($A278&\"#\"&O$1,'[1]Pt1-DATA'!$C:$C,0),0)","v":0},{"$f":"IFERROR(MATCH($A278&\"#\"&P$1,'[1]Pt1-DATA'!$C:$C,0),0)","v":0},{"$f":"IFERROR(MATCH($A278&\"#\"&Q$1,'[1]Pt1-DATA'!$C:$C,0),0)","v":0},{"$f":"IFERROR(MATCH($A278&\"#\"&R$1,'[1]Pt1-DATA'!$C:$C,0),0)","v":0},{"$f":"IFERROR(MATCH($A278&\"#\"&S$1,'[1]Pt1-DATA'!$C:$C,0),0)","v":0},{"$f":"IFERROR(MATCH($A278&\"#\"&T$1,'[1]Pt1-DATA'!$C:$C,0),0)","v":11624}]
[520,"Large Commercial Aircraft","Very large aircraft","A380","Airbus A380","Rolls-Royce Trent 900","wide body (IMA)",null,true,null,{"$f":"IFERROR(MATCH($A279&\"#\"&K$1,'[1]Pt1-DATA'!$C:$C,0),0)","v":458},null,{"$f":"IFERROR(MATCH($A279&\"#\"&M$1,'[1]Pt1-DATA'!$C:$C,0),0)","v":0},{"$f":"IFERROR(MATCH($A279&\"#\"&N$1,'[1]Pt1-DATA'!$C:$C,0),0)","v":7424},{"$f":"IFERROR(MATCH($A279&\"#\"&O$1,'[1]Pt1-DATA'!$C:$C,0),0)","v":0},{"$f":"IFERROR(MATCH($A279&\"#\"&P$1,'[1]Pt1-DATA'!$C:$C,0),0)","v":0},{"$f":"IFERROR(MATCH($A279&\"#\"&Q$1,'[1]Pt1-DATA'!$C:$C,0),0)","v":0},{"$f":"IFERROR(MATCH($A279&\"#\"&R$1,'[1]Pt1-DATA'!$C:$C,0),0)","v":0},{"$f":"IFERROR(MATCH($A279&\"#\"&S$1,'[1]Pt1-DATA'!$C:$C,0),0)","v":0},{"$f":"IFERROR(MATCH($A279&\"#\"&T$1,'[1]Pt1-DATA'!$C:$C,0),0)","v":11625}]
[530,"Large Commercial Aircraft","Very large aircraft","Boeing 747","Boeing 747-400","General Electric CF6-80C2","wide body (non IMA)",null,true,null,{"$f":"IFERROR(MATCH($A280&\"#\"&K$1,'[1]Pt1-DATA'!$C:$C,0),0)","v":430},null,{"$f":"IFERROR(MATCH($A280&\"#\"&M$1,'[1]Pt1-DATA'!$C:$C,0),0)","v":0},{"$f":"IFERROR(MATCH($A280&\"#\"&N$1,'[1]Pt1-DATA'!$C:$C,0),0)","v":0},{"$f":"IFERROR(MATCH($A280&\"#\"&O$1,'[1]Pt1-DATA'!$C:$C,0),0)","v":0},{"$f":"IFERROR(MATCH($A280&\"#\"&P$1,'[1]Pt1-DATA'!$C:$C,0),0)","v":0},{"$f":"IFERROR(MATCH($A280&\"#\"&Q$1,'[1]Pt1-DATA'!$C:$C,0),0)","v":0},{"$f":"IFERROR(MATCH($A280&\"#\"&R$1,'[1]Pt1-DATA'!$C:$C,0),0)","v":0},{"$f":"IFERROR(MATCH($A280&\"#\"&S$1,'[1]Pt1-DATA'!$C:$C,0),0)","v":0},{"$f":"IFERROR(MATCH($A280&\"#\"&T$1,'[1]Pt1-DATA'!$C:$C,0),0)","v":11626}]
[301,"Large Commercial Aircraft","Very large aircraft","Boeing 747","Boeing 747-400","Pratt & Whitney PW4000-94","wide body (non IMA)",null,true,null,{"$f":"IFERROR(MATCH($A281&\"#\"&K$1,'[1]Pt1-DATA'!$C:$C,0),0)","v":431},null,{"$f":"IFERROR(MATCH($A281&\"#\"&M$1,'[1]Pt1-DATA'!$C:$C,0),0)","v":0},{"$f":"IFERROR(MATCH($A281&\"#\"&N$1,'[1]Pt1-DATA'!$C:$C,0),0)","v":0},{"$f":"IFERROR(MATCH($A281&\"#\"&O$1,'[1]Pt1-DATA'!$C:$C,0),0)","v":0},{"$f":"IFERROR(MATCH($A281&\"#\"&P$1,'[1]Pt1-DATA'!$C:$C,0),0)","v":0},{"$f":"IFERROR(MATCH($A281&\"#\"&Q$1,'[1]Pt1-DATA'!$C:$C,0),0)","v":0},{"$f":"IFERROR(MATCH($A281&\"#\"&R$1,'[1]Pt1-DATA'!$C:$C,0),0)","v":0},{"$f":"IFERROR(MATCH($A281&\"#\"&S$1,'[1]Pt1-DATA'!$C:$C,0),0)","v":0},{"$f":"IFERROR(MATCH($A281&\"#\"&T$1,'[1]Pt1-DATA'!$C:$C,0),0)","v":11627}]
[531,"Large Commercial Aircraft","Very large aircraft","Boeing 747","Boeing 747-400","Rolls-Royce RB211-524G/H &T","wide body (non IMA)",null,true,null,{"$f":"IFERROR(MATCH($A282&\"#\"&K$1,'[1]Pt1-DATA'!$C:$C,0),0)","v":432},null,{"$f":"IFERROR(MATCH($A282&\"#\"&M$1,'[1]Pt1-DATA'!$C:$C,0),0)","v":0},{"$f":"IFERROR(MATCH($A282&\"#\"&N$1,'[1]Pt1-DATA'!$C:$C,0),0)","v":0},{"$f":"IFERROR(MATCH($A282&\"#\"&O$1,'[1]Pt1-DATA'!$C:$C,0),0)","v":0},{"$f":"IFERROR(MATCH($A282&\"#\"&P$1,'[1]Pt1-DATA'!$C:$C,0),0)","v":0},{"$f":"IFERROR(MATCH($A282&\"#\"&Q$1,'[1]Pt1-DATA'!$C:$C,0),0)","v":0},{"$f":"IFERROR(MATCH($A282&\"#\"&R$1,'[1]Pt1-DATA'!$C:$C,0),0)","v":0},{"$f":"IFERROR(MATCH($A282&\"#\"&S$1,'[1]Pt1-DATA'!$C:$C,0),0)","v":0},{"$f":"IFERROR(MATCH($A282&\"#\"&T$1,'[1]Pt1-DATA'!$C:$C,0),0)","v":11628}]
[16,"Large Commercial Aircraft","Very large aircraft","Boeing 747","Boeing 747-8I","General Electric GEnx-2B","wide body (non IMA)",null,true,null,{"$f":"IFERROR(MATCH($A283&\"#\"&K$1,'[1]Pt1-DATA'!$C:$C,0),0)","v":433},null,{"$f":"IFERROR(MATCH($A283&\"#\"&M$1,'[1]Pt1-DATA'!$C:$C,0),0)","v":0},{"$f":"IFERROR(MATCH($A283&\"#\"&N$1,'[1]Pt1-DATA'!$C:$C,0),0)","v":7422},{"$f":"IFERROR(MATCH($A283&\"#\"&O$1,'[1]Pt1-DATA'!$C:$C,0),0)","v":7639},{"$f":"IFERROR(MATCH($A283&\"#\"&P$1,'[1]Pt1-DATA'!$C:$C,0),0)","v":0},{"$f":"IFERROR(MATCH($A283&\"#\"&Q$1,'[1]Pt1-DATA'!$C:$C,0),0)","v":0},{"$f":"IFERROR(MATCH($A283&\"#\"&R$1,'[1]Pt1-DATA'!$C:$C,0),0)","v":0},{"$f":"IFERROR(MATCH($A283&\"#\"&S$1,'[1]Pt1-DATA'!$C:$C,0),0)","v":0},{"$f":"IFERROR(MATCH($A283&\"#\"&T$1,'[1]Pt1-DATA'!$C:$C,0),0)","v":11629}]
[658,"Military Transport / Special Mission","Military Jet","A330 LMXT","Lockheed martin/Airbus A330 LMXT","Rolls-Royce Trent 700","wide body (non IMA)",null,true,null,{"$f":"IFERROR(MATCH($A284&\"#\"&K$1,'[1]Pt1-DATA'!$C:$C,0),0)","v":438},null,{"$f":"IFERROR(MATCH($A284&\"#\"&M$1,'[1]Pt1-DATA'!$C:$C,0),0)","v":0},{"$f":"IFERROR(MATCH($A284&\"#\"&N$1,'[1]Pt1-DATA'!$C:$C,0),0)","v":0},{"$f":"IFERROR(MATCH($A284&\"#\"&O$1,'[1]Pt1-DATA'!$C:$C,0),0)","v":0},{"$f":"IFERROR(MATCH($A284&\"#\"&P$1,'[1]Pt1-DATA'!$C:$C,0),0)","v":0},{"$f":"IFERROR(MATCH($A284&\"#\"&Q$1,'[1]Pt1-DATA'!$C:$C,0),0)","v":0},{"$f":"IFERROR(MATCH($A284&\"#\"&R$1,'[1]Pt1-DATA'!$C:$C,0),0)","v":0},{"$f":"IFERROR(MATCH($A284&\"#\"&S$1,'[1]Pt1-DATA'!$C:$C,0),0)","v":9559},{"$f":"IFERROR(MATCH($A284&\"#\"&T$1,'[1]Pt1-DATA'!$C:$C,0),0)","v":11630}]
[551,"Military Transport / Special Mission","Military Jet","A330 MRTT","Airbus A330 MRTT","General Electric CF6-80E1","wide body (non IMA)",null,true,null,{"$f":"IFERROR(MATCH($A285&\"#\"&K$1,'[1]Pt1-DATA'!$C:$C,0),0)","v":439},null,{"$f":"IFERROR(MATCH($A285&\"#\"&M$1,'[1]Pt1-DATA'!$C:$C,0),0)","v":0},{"$f":"IFERROR(MATCH($A285&\"#\"&N$1,'[1]Pt1-DATA'!$C:$C,0),0)","v":0},{"$f":"IFERROR(MATCH($A285&\"#\"&O$1,'[1]Pt1-DATA'!$C:$C,0),0)","v":0},{"$f":"IFERROR(MATCH($A285&\"#\"&P$1,'[1]Pt1-DATA'!$C:$C,0),0)","v":0},{"$f":"IFERROR(MATCH($A285&\"#\"&Q$1,'[1]Pt1-DATA'!$C:$C,0),0)","v":0},{"$f":"IFERROR(MATCH($A285&\"#\"&R$1,'[1]Pt1-DATA'!$C:$C,0),0)","v":0},{"$f":"IFERROR(MATCH($A285&\"#\"&S$1,'[1]Pt1-DATA'!$C:$C,0),0)","v":9560},{"$f":"IFERROR(MATCH($A285&\"#\"&T$1,'[1]Pt1-DATA'!$C:$C,0),0)","v":11631}]
[151,"Military Transport / Special Mission","Military Jet","A330 MRTT","Airbus A330 MRTT","Rolls-Royce Trent 700","wide body (non IMA)",null,true,null,{"$f":"IFERROR(MATCH($A286&\"#\"&K$1,'[1]Pt1-DATA'!$C:$C,0),0)","v":440},null,{"$f":"IFERROR(MATCH($A286&\"#\"&M$1,'[1]Pt1-DATA'!$C:$C,0),0)","v":0},{"$f":"IFERROR(MATCH($A286&\"#\"&N$1,'[1]Pt1-DATA'!$C:$C,0),0)","v":0},{"$f":"IFERROR(MATCH($A286&\"#\"&O$1,'[1]Pt1-DATA'!$C:$C,0),0)","v":0},{"$f":"IFERROR(MATCH($A286&\"#\"&P$1,'[1]Pt1-DATA'!$C:$C,0),0)","v":0},{"$f":"IFERROR(MATCH($A286&\"#\"&Q$1,'[1]Pt1-DATA'!$C:$C,0),0)","v":0},{"$f":"IFERROR(MATCH($A286&\"#\"&R$1,'[1]Pt1-DATA'!$C:$C,0),0)","v":0},{"$f":"IFERROR(MATCH($A286&\"#\"&S$1,'[1]Pt1-DATA'!$C:$C,0),0)","v":9561},{"$f":"IFERROR(MATCH($A286&\"#\"&T$1,'[1]Pt1-DATA'!$C:$C,0),0)","v":11632}]
[636,"Military Transport / Special Mission","Military Jet","B-52 Stratofortress","Boeing B-52 Stratofortress","Pratt & Whitney TF33-P-3/103","Mil trans",null,true,null,{"$f":"IFERROR(MATCH($A287&\"#\"&K$1,'[1]Pt1-DATA'!$C:$C,0),0)","v":320},null,{"$f":"IFERROR(MATCH($A287&\"#\"&M$1,'[1]Pt1-DATA'!$C:$C,0),0)","v":0},{"$f":"IFERROR(MATCH($A287&\"#\"&N$1,'[1]Pt1-DATA'!$C:$C,0),0)","v":0},{"$f":"IFERROR(MATCH($A287&\"#\"&O$1,'[1]Pt1-DATA'!$C:$C,0),0)","v":0},{"$f":"IFERROR(MATCH($A287&\"#\"&P$1,'[1]Pt1-DATA'!$C:$C,0),0)","v":0},{"$f":"IFERROR(MATCH($A287&\"#\"&Q$1,'[1]Pt1-DATA'!$C:$C,0),0)","v":0},{"$f":"IFERROR(MATCH($A287&\"#\"&R$1,'[1]Pt1-DATA'!$C:$C,0),0)","v":0},{"$f":"IFERROR(MATCH($A287&\"#\"&S$1,'[1]Pt1-DATA'!$C:$C,0),0)","v":9562},{"$f":"IFERROR(MATCH($A287&\"#\"&T$1,'[1]Pt1-DATA'!$C:$C,0),0)","v":11633}]
[676,"Military Transport / Special Mission","Military Jet","B-52 Stratofortress","Boeing B-52 Stratofortress re-engine","Rolls-Royce BR725","Mil trans",null,true,null,{"$f":"IFERROR(MATCH($A288&\"#\"&K$1,'[1]Pt1-DATA'!$C:$C,0),0)","v":321},null,{"$f":"IFERROR(MATCH($A288&\"#\"&M$1,'[1]Pt1-DATA'!$C:$C,0),0)","v":0},{"$f":"IFERROR(MATCH($A288&\"#\"&N$1,'[1]Pt1-DATA'!$C:$C,0),0)","v":0},{"$f":"IFERROR(MATCH($A288&\"#\"&O$1,'[1]Pt1-DATA'!$C:$C,0),0)","v":0},{"$f":"IFERROR(MATCH($A288&\"#\"&P$1,'[1]Pt1-DATA'!$C:$C,0),0)","v":0},{"$f":"IFERROR(MATCH($A288&\"#\"&Q$1,'[1]Pt1-DATA'!$C:$C,0),0)","v":0},{"$f":"IFERROR(MATCH($A288&\"#\"&R$1,'[1]Pt1-DATA'!$C:$C,0),0)","v":0},{"$f":"IFERROR(MATCH($A288&\"#\"&S$1,'[1]Pt1-DATA'!$C:$C,0),0)","v":9563},{"$f":"IFERROR(MATCH($A288&\"#\"&T$1,'[1]Pt1-DATA'!$C:$C,0),0)","v":11634}]
[157,"Military Transport / Special Mission","Military Jet","Boeing KC-46 Pegasus","Boeing KC-46 Pegasus","Pratt & Whitney PW4000-94","wide body (non IMA)",null,true,null,{"$f":"IFERROR(MATCH($A289&\"#\"&K$1,'[1]Pt1-DATA'!$C:$C,0),0)","v":441},null,{"$f":"IFERROR(MATCH($A289&\"#\"&M$1,'[1]Pt1-DATA'!$C:$C,0),0)","v":0},{"$f":"IFERROR(MATCH($A289&\"#\"&N$1,'[1]Pt1-DATA'!$C:$C,0),0)","v":0},{"$f":"IFERROR(MATCH($A289&\"#\"&O$1,'[1]Pt1-DATA'!$C:$C,0),0)","v":0},{"$f":"IFERROR(MATCH($A289&\"#\"&P$1,'[1]Pt1-DATA'!$C:$C,0),0)","v":0},{"$f":"IFERROR(MATCH($A289&\"#\"&Q$1,'[1]Pt1-DATA'!$C:$C,0),0)","v":0},{"$f":"IFERROR(MATCH($A289&\"#\"&R$1,'[1]Pt1-DATA'!$C:$C,0),0)","v":0},{"$f":"IFERROR(MATCH($A289&\"#\"&S$1,'[1]Pt1-DATA'!$C:$C,0),0)","v":9564},{"$f":"IFERROR(MATCH($A289&\"#\"&T$1,'[1]Pt1-DATA'!$C:$C,0),0)","v":11635}]
[156,"Military Transport / Special Mission","Military Jet","Boeing P-8 Poseidon","Boeing P-8 Poseidon","CFM International CFM56 - 7B","Narrow Body",null,true,null,{"$f":"IFERROR(MATCH($A290&\"#\"&K$1,'[1]Pt1-DATA'!$C:$C,0),0)","v":322},null,{"$f":"IFERROR(MATCH($A290&\"#\"&M$1,'[1]Pt1-DATA'!$C:$C,0),0)","v":0},{"$f":"IFERROR(MATCH($A290&\"#\"&N$1,'[1]Pt1-DATA'!$C:$C,0),0)","v":0},{"$f":"IFERROR(MATCH($A290&\"#\"&O$1,'[1]Pt1-DATA'!$C:$C,0),0)","v":0},{"$f":"IFERROR(MATCH($A290&\"#\"&P$1,'[1]Pt1-DATA'!$C:$C,0),0)","v":0},{"$f":"IFERROR(MATCH($A290&\"#\"&Q$1,'[1]Pt1-DATA'!$C:$C,0),0)","v":0},{"$f":"IFERROR(MATCH($A290&\"#\"&R$1,'[1]Pt1-DATA'!$C:$C,0),0)","v":0},{"$f":"IFERROR(MATCH($A290&\"#\"&S$1,'[1]Pt1-DATA'!$C:$C,0),0)","v":9565},{"$f":"IFERROR(MATCH($A290&\"#\"&T$1,'[1]Pt1-DATA'!$C:$C,0),0)","v":11636}]
[158,"Military Transport / Special Mission","Military Jet","C-17","Boeing C-17 Globemaster III","F117-PW-100","Mil trans",null,true,null,{"$f":"IFERROR(MATCH($A291&\"#\"&K$1,'[1]Pt1-DATA'!$C:$C,0),0)","v":442},null,{"$f":"IFERROR(MATCH($A291&\"#\"&M$1,'[1]Pt1-DATA'!$C:$C,0),0)","v":0},{"$f":"IFERROR(MATCH($A291&\"#\"&N$1,'[1]Pt1-DATA'!$C:$C,0),0)","v":0},{"$f":"IFERROR(MATCH($A291&\"#\"&O$1,'[1]Pt1-DATA'!$C:$C,0),0)","v":0},{"$f":"IFERROR(MATCH($A291&\"#\"&P$1,'[1]Pt1-DATA'!$C:$C,0),0)","v":0},{"$f":"IFERROR(MATCH($A291&\"#\"&Q$1,'[1]Pt1-DATA'!$C:$C,0),0)","v":0},{"$f":"IFERROR(MATCH($A291&\"#\"&R$1,'[1]Pt1-DATA'!$C:$C,0),0)","v":0},{"$f":"IFERROR(MATCH($A291&\"#\"&S$1,'[1]Pt1-DATA'!$C:$C,0),0)","v":9566},{"$f":"IFERROR(MATCH($A291&\"#\"&T$1,'[1]Pt1-DATA'!$C:$C,0),0)","v":11637}]
[163,"Military Transport / Special Mission","Military Jet","C-5","Lockheed C-5 Galaxy","General Electric CF6-80C2","Mil trans",null,true,null,{"$f":"IFERROR(MATCH($A292&\"#\"&K$1,'[1]Pt1-DATA'!$C:$C,0),0)","v":443},null,{"$f":"IFERROR(MATCH($A292&\"#\"&M$1,'[1]Pt1-DATA'!$C:$C,0),0)","v":0},{"$f":"IFERROR(MATCH($A292&\"#\"&N$1,'[1]Pt1-DATA'!$C:$C,0),0)","v":0},{"$f":"IFERROR(MATCH($A292&\"#\"&O$1,'[1]Pt1-DATA'!$C:$C,0),0)","v":0},{"$f":"IFERROR(MATCH($A292&\"#\"&P$1,'[1]Pt1-DATA'!$C:$C,0),0)","v":0},{"$f":"IFERROR(MATCH($A292&\"#\"&Q$1,'[1]Pt1-DATA'!$C:$C,0),0)","v":0},{"$f":"IFERROR(MATCH($A292&\"#\"&R$1,'[1]Pt1-DATA'!$C:$C,0),0)","v":0},{"$f":"IFERROR(MATCH($A292&\"#\"&S$1,'[1]Pt1-DATA'!$C:$C,0),0)","v":9567},{"$f":"IFERROR(MATCH($A292&\"#\"&T$1,'[1]Pt1-DATA'!$C:$C,0),0)","v":11638}]
[159,"Military Transport / Special Mission","Military Jet","Embraer KC-390","Embraer KC-390","IAE V2500-E5","Mil trans",null,true,null,{"$f":"IFERROR(MATCH($A293&\"#\"&K$1,'[1]Pt1-DATA'!$C:$C,0),0)","v":444},null,{"$f":"IFERROR(MATCH($A293&\"#\"&M$1,'[1]Pt1-DATA'!$C:$C,0),0)","v":0},{"$f":"IFERROR(MATCH($A293&\"#\"&N$1,'[1]Pt1-DATA'!$C:$C,0),0)","v":0},{"$f":"IFERROR(MATCH($A293&\"#\"&O$1,'[1]Pt1-DATA'!$C:$C,0),0)","v":0},{"$f":"IFERROR(MATCH($A293&\"#\"&P$1,'[1]Pt1-DATA'!$C:$C,0),0)","v":0},{"$f":"IFERROR(MATCH($A293&\"#\"&Q$1,'[1]Pt1-DATA'!$C:$C,0),0)","v":0},{"$f":"IFERROR(MATCH($A293&\"#\"&R$1,'[1]Pt1-DATA'!$C:$C,0),0)","v":0},{"$f":"IFERROR(MATCH($A293&\"#\"&S$1,'[1]Pt1-DATA'!$C:$C,0),0)","v":9568},{"$f":"IFERROR(MATCH($A293&\"#\"&T$1,'[1]Pt1-DATA'!$C:$C,0),0)","v":11639}]
[160,"Military Transport / Special Mission","Military Jet","Kawasaki C-2","Kawasaki C-2","General Electric CF6-80C2","Mil trans",null,true,null,{"$f":"IFERROR(MATCH($A294&\"#\"&K$1,'[1]Pt1-DATA'!$C:$C,0),0)","v":445},null,{"$f":"IFERROR(MATCH($A294&\"#\"&M$1,'[1]Pt1-DATA'!$C:$C,0),0)","v":0},{"$f":"IFERROR(MATCH($A294&\"#\"&N$1,'[1]Pt1-DATA'!$C:$C,0),0)","v":0},{"$f":"IFERROR(MATCH($A294&\"#\"&O$1,'[1]Pt1-DATA'!$C:$C,0),0)","v":0},{"$f":"IFERROR(MATCH($A294&\"#\"&P$1,'[1]Pt1-DATA'!$C:$C,0),0)","v":0},{"$f":"IFERROR(MATCH($A294&\"#\"&Q$1,'[1]Pt1-DATA'!$C:$C,0),0)","v":0},{"$f":"IFERROR(MATCH($A294&\"#\"&R$1,'[1]Pt1-DATA'!$C:$C,0),0)","v":0},{"$f":"IFERROR(MATCH($A294&\"#\"&S$1,'[1]Pt1-DATA'!$C:$C,0),0)","v":9569},{"$f":"IFERROR(MATCH($A294&\"#\"&T$1,'[1]Pt1-DATA'!$C:$C,0),0)","v":11640}]
[161,"Military Transport / Special Mission","Military Jet","Kawasaki P-1","Kawasaki P-1","IHI Corporation F7","Mil trans",null,true,null,{"$f":"IFERROR(MATCH($A295&\"#\"&K$1,'[1]Pt1-DATA'!$C:$C,0),0)","v":446},null,{"$f":"IFERROR(MATCH($A295&\"#\"&M$1,'[1]Pt1-DATA'!$C:$C,0),0)","v":0},{"$f":"IFERROR(MATCH($A295&\"#\"&N$1,'[1]Pt1-DATA'!$C:$C,0),0)","v":0},{"$f":"IFERROR(MATCH($A295&\"#\"&O$1,'[1]Pt1-DATA'!$C:$C,0),0)","v":0},{"$f":"IFERROR(MATCH($A295&\"#\"&P$1,'[1]Pt1-DATA'!$C:$C,0),0)","v":0},{"$f":"IFERROR(MATCH($A295&\"#\"&Q$1,'[1]Pt1-DATA'!$C:$C,0),0)","v":0},{"$f":"IFERROR(MATCH($A295&\"#\"&R$1,'[1]Pt1-DATA'!$C:$C,0),0)","v":0},{"$f":"IFERROR(MATCH($A295&\"#\"&S$1,'[1]Pt1-DATA'!$C:$C,0),0)","v":9570},{"$f":"IFERROR(MATCH($A295&\"#\"&T$1,'[1]Pt1-DATA'!$C:$C,0),0)","v":11641}]
[150,"Military Transport / Special Mission","Military Turboprop","A400M Atlas","Airbus A400M Atlas","Europrop TP400","Mil trans","wide body (IMA)",true,null,{"$f":"IFERROR(MATCH($A296&\"#\"&K$1,'[1]Pt1-DATA'!$C:$C,0),0)","v":447},null,{"$f":"IFERROR(MATCH($A296&\"#\"&M$1,'[1]Pt1-DATA'!$C:$C,0),0)","v":0},{"$f":"IFERROR(MATCH($A296&\"#\"&N$1,'[1]Pt1-DATA'!$C:$C,0),0)","v":0},{"$f":"IFERROR(MATCH($A296&\"#\"&O$1,'[1]Pt1-DATA'!$C:$C,0),0)","v":0},{"$f":"IFERROR(MATCH($A296&\"#\"&P$1,'[1]Pt1-DATA'!$C:$C,0),0)","v":0},{"$f":"IFERROR(MATCH($A296&\"#\"&Q$1,'[1]Pt1-DATA'!$C:$C,0),0)","v":0},{"$f":"IFERROR(MATCH($A296&\"#\"&R$1,'[1]Pt1-DATA'!$C:$C,0),0)","v":0},{"$f":"IFERROR(MATCH($A296&\"#\"&S$1,'[1]Pt1-DATA'!$C:$C,0),0)","v":9571},{"$f":"IFERROR(MATCH($A296&\"#\"&T$1,'[1]Pt1-DATA'!$C:$C,0),0)","v":11642}]
[155,"Military Transport / Special Mission","Military Turboprop","Alenia C-27J","Alenia C-27J","Rolls-Royce AE 2100","Mil trans",null,true,null,{"$f":"IFERROR(MATCH($A297&\"#\"&K$1,'[1]Pt1-DATA'!$C:$C,0),0)","v":448},null,{"$f":"IFERROR(MATCH($A297&\"#\"&M$1,'[1]Pt1-DATA'!$C:$C,0),0)","v":0},{"$f":"IFERROR(MATCH($A297&\"#\"&N$1,'[1]Pt1-DATA'!$C:$C,0),0)","v":0},{"$f":"IFERROR(MATCH($A297&\"#\"&O$1,'[1]Pt1-DATA'!$C:$C,0),0)","v":0},{"$f":"IFERROR(MATCH($A297&\"#\"&P$1,'[1]Pt1-DATA'!$C:$C,0),0)","v":0},{"$f":"IFERROR(MATCH($A297&\"#\"&Q$1,'[1]Pt1-DATA'!$C:$C,0),0)","v":0},{"$f":"IFERROR(MATCH($A297&\"#\"&R$1,'[1]Pt1-DATA'!$C:$C,0),0)","v":0},{"$f":"IFERROR(MATCH($A297&\"#\"&S$1,'[1]Pt1-DATA'!$C:$C,0),0)","v":9572},{"$f":"IFERROR(MATCH($A297&\"#\"&T$1,'[1]Pt1-DATA'!$C:$C,0),0)","v":11643}]
[162,"Military Transport / Special Mission","Military Turboprop","C-130J","Lockheed Martin C-130J Super Hercules","Rolls-Royce AE 2100","Mil trans",null,true,null,{"$f":"IFERROR(MATCH($A298&\"#\"&K$1,'[1]Pt1-DATA'!$C:$C,0),0)","v":449},null,{"$f":"IFERROR(MATCH($A298&\"#\"&M$1,'[1]Pt1-DATA'!$C:$C,0),0)","v":0},{"$f":"IFERROR(MATCH($A298&\"#\"&N$1,'[1]Pt1-DATA'!$C:$C,0),0)","v":0},{"$f":"IFERROR(MATCH($A298&\"#\"&O$1,'[1]Pt1-DATA'!$C:$C,0),0)","v":0},{"$f":"IFERROR(MATCH($A298&\"#\"&P$1,'[1]Pt1-DATA'!$C:$C,0),0)","v":0},{"$f":"IFERROR(MATCH($A298&\"#\"&Q$1,'[1]Pt1-DATA'!$C:$C,0),0)","v":0},{"$f":"IFERROR(MATCH($A298&\"#\"&R$1,'[1]Pt1-DATA'!$C:$C,0),0)","v":0},{"$f":"IFERROR(MATCH($A298&\"#\"&S$1,'[1]Pt1-DATA'!$C:$C,0),0)","v":9558},{"$f":"IFERROR(MATCH($A298&\"#\"&T$1,'[1]Pt1-DATA'!$C:$C,0),0)","v":11644}]
[152,"Military Transport / Special Mission","Military Turboprop","CASA C-212 Aviocar","CASA C-212 Aviocar","Honeywell TPE331","Mil trans",null,true,null,{"$f":"IFERROR(MATCH($A299&\"#\"&K$1,'[1]Pt1-DATA'!$C:$C,0),0)","v":450},null,{"$f":"IFERROR(MATCH($A299&\"#\"&M$1,'[1]Pt1-DATA'!$C:$C,0),0)","v":0},{"$f":"IFERROR(MATCH($A299&\"#\"&N$1,'[1]Pt1-DATA'!$C:$C,0),0)","v":0},{"$f":"IFERROR(MATCH($A299&\"#\"&O$1,'[1]Pt1-DATA'!$C:$C,0),0)","v":0},{"$f":"IFERROR(MATCH($A299&\"#\"&P$1,'[1]Pt1-DATA'!$C:$C,0),0)","v":0},{"$f":"IFERROR(MATCH($A299&\"#\"&Q$1,'[1]Pt1-DATA'!$C:$C,0),0)","v":0},{"$f":"IFERROR(MATCH($A299&\"#\"&R$1,'[1]Pt1-DATA'!$C:$C,0),0)","v":0},{"$f":"IFERROR(MATCH($A299&\"#\"&S$1,'[1]Pt1-DATA'!$C:$C,0),0)","v":9573},{"$f":"IFERROR(MATCH($A299&\"#\"&T$1,'[1]Pt1-DATA'!$C:$C,0),0)","v":11645}]
[153,"Military Transport / Special Mission","Military Turboprop","CASA/IPTN CN-235","CASA/IPTN CN-235","General Electric T700 - CT7 turboprop","Mil trans",null,true,null,{"$f":"IFERROR(MATCH($A300&\"#\"&K$1,'[1]Pt1-DATA'!$C:$C,0),0)","v":451},null,{"$f":"IFERROR(MATCH($A300&\"#\"&M$1,'[1]Pt1-DATA'!$C:$C,0),0)","v":0},{"$f":"IFERROR(MATCH($A300&\"#\"&N$1,'[1]Pt1-DATA'!$C:$C,0),0)","v":0},{"$f":"IFERROR(MATCH($A300&\"#\"&O$1,'[1]Pt1-DATA'!$C:$C,0),0)","v":0},{"$f":"IFERROR(MATCH($A300&\"#\"&P$1,'[1]Pt1-DATA'!$C:$C,0),0)","v":0},{"$f":"IFERROR(MATCH($A300&\"#\"&Q$1,'[1]Pt1-DATA'!$C:$C,0),0)","v":0},{"$f":"IFERROR(MATCH($A300&\"#\"&R$1,'[1]Pt1-DATA'!$C:$C,0),0)","v":0},{"$f":"IFERROR(MATCH($A300&\"#\"&S$1,'[1]Pt1-DATA'!$C:$C,0),0)","v":9574},{"$f":"IFERROR(MATCH($A300&\"#\"&T$1,'[1]Pt1-DATA'!$C:$C,0),0)","v":11646}]
[164,"Military Transport / Special Mission","Military Turboprop","E-2","Northrop Grumman E-2 Hawkeye","Allison T56","Mil trans",null,true,null,{"$f":"IFERROR(MATCH($A301&\"#\"&K$1,'[1]Pt1-DATA'!$C:$C,0),0)","v":452},null,{"$f":"IFERROR(MATCH($A301&\"#\"&M$1,'[1]Pt1-DATA'!$C:$C,0),0)","v":0},{"$f":"IFERROR(MATCH($A301&\"#\"&N$1,'[1]Pt1-DATA'!$C:$C,0),0)","v":0},{"$f":"IFERROR(MATCH($A301&\"#\"&O$1,'[1]Pt1-DATA'!$C:$C,0),0)","v":0},{"$f":"IFERROR(MATCH($A301&\"#\"&P$1,'[1]Pt1-DATA'!$C:$C,0),0)","v":0},{"$f":"IFERROR(MATCH($A301&\"#\"&Q$1,'[1]Pt1-DATA'!$C:$C,0),0)","v":0},{"$f":"IFERROR(MATCH($A301&\"#\"&R$1,'[1]Pt1-DATA'!$C:$C,0),0)","v":0},{"$f":"IFERROR(MATCH($A301&\"#\"&S$1,'[1]Pt1-DATA'!$C:$C,0),0)","v":9575},{"$f":"IFERROR(MATCH($A301&\"#\"&T$1,'[1]Pt1-DATA'!$C:$C,0),0)","v":11647}]
[154,"Military Transport / Special Mission","Military Turboprop","EADS CASA C-295","EADS CASA C-295","Pratt & Whitney Canada PW120","Mil trans",null,true,null,{"$f":"IFERROR(MATCH($A302&\"#\"&K$1,'[1]Pt1-DATA'!$C:$C,0),0)","v":453},null,{"$f":"IFERROR(MATCH($A302&\"#\"&M$1,'[1]Pt1-DATA'!$C:$C,0),0)","v":0},{"$f":"IFERROR(MATCH($A302&\"#\"&N$1,'[1]Pt1-DATA'!$C:$C,0),0)","v":0},{"$f":"IFERROR(MATCH($A302&\"#\"&O$1,'[1]Pt1-DATA'!$C:$C,0),0)","v":0},{"$f":"IFERROR(MATCH($A302&\"#\"&P$1,'[1]Pt1-DATA'!$C:$C,0),0)","v":0},{"$f":"IFERROR(MATCH($A302&\"#\"&Q$1,'[1]Pt1-DATA'!$C:$C,0),0)","v":0},{"$f":"IFERROR(MATCH($A302&\"#\"&R$1,'[1]Pt1-DATA'!$C:$C,0),0)","v":0},{"$f":"IFERROR(MATCH($A302&\"#\"&S$1,'[1]Pt1-DATA'!$C:$C,0),0)","v":9576},{"$f":"IFERROR(MATCH($A302&\"#\"&T$1,'[1]Pt1-DATA'!$C:$C,0),0)","v":11648}]
[181,"Military Transport / Special Mission","Military Turboprop","ShinMaywa US-2","ShinMaywa US-2","Rolls-Royce AE 2100","Mil trans",null,true,null,{"$f":"IFERROR(MATCH($A303&\"#\"&K$1,'[1]Pt1-DATA'!$C:$C,0),0)","v":454},null,{"$f":"IFERROR(MATCH($A303&\"#\"&M$1,'[1]Pt1-DATA'!$C:$C,0),0)","v":0},{"$f":"IFERROR(MATCH($A303&\"#\"&N$1,'[1]Pt1-DATA'!$C:$C,0),0)","v":0},{"$f":"IFERROR(MATCH($A303&\"#\"&O$1,'[1]Pt1-DATA'!$C:$C,0),0)","v":0},{"$f":"IFERROR(MATCH($A303&\"#\"&P$1,'[1]Pt1-DATA'!$C:$C,0),0)","v":0},{"$f":"IFERROR(MATCH($A303&\"#\"&Q$1,'[1]Pt1-DATA'!$C:$C,0),0)","v":0},{"$f":"IFERROR(MATCH($A303&\"#\"&R$1,'[1]Pt1-DATA'!$C:$C,0),0)","v":0},{"$f":"IFERROR(MATCH($A303&\"#\"&S$1,'[1]Pt1-DATA'!$C:$C,0),0)","v":9577},{"$f":"IFERROR(MATCH($A303&\"#\"&T$1,'[1]Pt1-DATA'!$C:$C,0),0)","v":11649}]
[574,"Military Transport / Special Mission","Transport & Utility","Boeing C-40 Clipper ","Boeing C-40 Clipper","CFM International CFM56 - 7B","Mil trans",null,true,null,{"$f":"IFERROR(MATCH($A304&\"#\"&K$1,'[1]Pt1-DATA'!$C:$C,0),0)","v":323},null,{"$f":"IFERROR(MATCH($A304&\"#\"&M$1,'[1]Pt1-DATA'!$C:$C,0),0)","v":0},{"$f":"IFERROR(MATCH($A304&\"#\"&N$1,'[1]Pt1-DATA'!$C:$C,0),0)","v":0},{"$f":"IFERROR(MATCH($A304&\"#\"&O$1,'[1]Pt1-DATA'!$C:$C,0),0)","v":0},{"$f":"IFERROR(MATCH($A304&\"#\"&P$1,'[1]Pt1-DATA'!$C:$C,0),0)","v":0},{"$f":"IFERROR(MATCH($A304&\"#\"&Q$1,'[1]Pt1-DATA'!$C:$C,0),0)","v":0},{"$f":"IFERROR(MATCH($A304&\"#\"&R$1,'[1]Pt1-DATA'!$C:$C,0),0)","v":0},{"$f":"IFERROR(MATCH($A304&\"#\"&S$1,'[1]Pt1-DATA'!$C:$C,0),0)","v":9578},{"$f":"IFERROR(MATCH($A304&\"#\"&T$1,'[1]Pt1-DATA'!$C:$C,0),0)","v":11650}]
[620,"Military Transport / Special Mission","Transport & Utility","Boeing KC-135 Stratotanker","Boeing KC-135 Stratotanker","CFM F108 (CFM56-2)","Mil trans",null,true,null,{"$f":"IFERROR(MATCH($A305&\"#\"&K$1,'[1]Pt1-DATA'!$C:$C,0),0)","v":455},null,{"$f":"IFERROR(MATCH($A305&\"#\"&M$1,'[1]Pt1-DATA'!$C:$C,0),0)","v":0},{"$f":"IFERROR(MATCH($A305&\"#\"&N$1,'[1]Pt1-DATA'!$C:$C,0),0)","v":0},{"$f":"IFERROR(MATCH($A305&\"#\"&O$1,'[1]Pt1-DATA'!$C:$C,0),0)","v":0},{"$f":"IFERROR(MATCH($A305&\"#\"&P$1,'[1]Pt1-DATA'!$C:$C,0),0)","v":0},{"$f":"IFERROR(MATCH($A305&\"#\"&Q$1,'[1]Pt1-DATA'!$C:$C,0),0)","v":0},{"$f":"IFERROR(MATCH($A305&\"#\"&R$1,'[1]Pt1-DATA'!$C:$C,0),0)","v":0},{"$f":"IFERROR(MATCH($A305&\"#\"&S$1,'[1]Pt1-DATA'!$C:$C,0),0)","v":9579},{"$f":"IFERROR(MATCH($A305&\"#\"&T$1,'[1]Pt1-DATA'!$C:$C,0),0)","v":11651}]
[619,"Military Transport / Special Mission","Transport & Utility","McDonnell Douglas KC-10","McDonnell Douglas KC-10","General Electric F103 (CF6-50C)","wide body (non IMA)",null,true,null,{"$f":"IFERROR(MATCH($A306&\"#\"&K$1,'[1]Pt1-DATA'!$C:$C,0),0)","v":456},null,{"$f":"IFERROR(MATCH($A306&\"#\"&M$1,'[1]Pt1-DATA'!$C:$C,0),0)","v":0},{"$f":"IFERROR(MATCH($A306&\"#\"&N$1,'[1]Pt1-DATA'!$C:$C,0),0)","v":0},{"$f":"IFERROR(MATCH($A306&\"#\"&O$1,'[1]Pt1-DATA'!$C:$C,0),0)","v":0},{"$f":"IFERROR(MATCH($A306&\"#\"&P$1,'[1]Pt1-DATA'!$C:$C,0),0)","v":0},{"$f":"IFERROR(MATCH($A306&\"#\"&Q$1,'[1]Pt1-DATA'!$C:$C,0),0)","v":0},{"$f":"IFERROR(MATCH($A306&\"#\"&R$1,'[1]Pt1-DATA'!$C:$C,0),0)","v":0},{"$f":"IFERROR(MATCH($A306&\"#\"&S$1,'[1]Pt1-DATA'!$C:$C,0),0)","v":9580},{"$f":"IFERROR(MATCH($A306&\"#\"&T$1,'[1]Pt1-DATA'!$C:$C,0),0)","v":11652}]
[618,"Regional","Regional Jet","Bombardier CRJ","Bombardier CRJ200","General Electric CF34-3B","regional",null,true,null,{"$f":"IFERROR(MATCH($A307&\"#\"&K$1,'[1]Pt1-DATA'!$C:$C,0),0)","v":344},null,{"$f":"IFERROR(MATCH($A307&\"#\"&M$1,'[1]Pt1-DATA'!$C:$C,0),0)","v":0},{"$f":"IFERROR(MATCH($A307&\"#\"&N$1,'[1]Pt1-DATA'!$C:$C,0),0)","v":0},{"$f":"IFERROR(MATCH($A307&\"#\"&O$1,'[1]Pt1-DATA'!$C:$C,0),0)","v":0},{"$f":"IFERROR(MATCH($A307&\"#\"&P$1,'[1]Pt1-DATA'!$C:$C,0),0)","v":0},{"$f":"IFERROR(MATCH($A307&\"#\"&Q$1,'[1]Pt1-DATA'!$C:$C,0),0)","v":8267},{"$f":"IFERROR(MATCH($A307&\"#\"&R$1,'[1]Pt1-DATA'!$C:$C,0),0)","v":0},{"$f":"IFERROR(MATCH($A307&\"#\"&S$1,'[1]Pt1-DATA'!$C:$C,0),0)","v":0},{"$f":"IFERROR(MATCH($A307&\"#\"&T$1,'[1]Pt1-DATA'!$C:$C,0),0)","v":0}]
[220,"Regional","Regional Jet","Bombardier CRJ","Bombardier CRJ700-1000","General Electric CF34-8C","regional",null,true,null,{"$f":"IFERROR(MATCH($A308&\"#\"&K$1,'[1]Pt1-DATA'!$C:$C,0),0)","v":345},null,{"$f":"IFERROR(MATCH($A308&\"#\"&M$1,'[1]Pt1-DATA'!$C:$C,0),0)","v":0},{"$f":"IFERROR(MATCH($A308&\"#\"&N$1,'[1]Pt1-DATA'!$C:$C,0),0)","v":0},{"$f":"IFERROR(MATCH($A308&\"#\"&O$1,'[1]Pt1-DATA'!$C:$C,0),0)","v":0},{"$f":"IFERROR(MATCH($A308&\"#\"&P$1,'[1]Pt1-DATA'!$C:$C,0),0)","v":0},{"$f":"IFERROR(MATCH($A308&\"#\"&Q$1,'[1]Pt1-DATA'!$C:$C,0),0)","v":8268},{"$f":"IFERROR(MATCH($A308&\"#\"&R$1,'[1]Pt1-DATA'!$C:$C,0),0)","v":0},{"$f":"IFERROR(MATCH($A308&\"#\"&S$1,'[1]Pt1-DATA'!$C:$C,0),0)","v":0},{"$f":"IFERROR(MATCH($A308&\"#\"&T$1,'[1]Pt1-DATA'!$C:$C,0),0)","v":0}]
[218,"Regional","Regional Jet","Bombardier CRJ","Bombardier CRJ700-700","General Electric CF34-8C","regional",null,true,null,{"$f":"IFERROR(MATCH($A309&\"#\"&K$1,'[1]Pt1-DATA'!$C:$C,0),0)","v":346},null,{"$f":"IFERROR(MATCH($A309&\"#\"&M$1,'[1]Pt1-DATA'!$C:$C,0),0)","v":0},{"$f":"IFERROR(MATCH($A309&\"#\"&N$1,'[1]Pt1-DATA'!$C:$C,0),0)","v":0},{"$f":"IFERROR(MATCH($A309&\"#\"&O$1,'[1]Pt1-DATA'!$C:$C,0),0)","v":0},{"$f":"IFERROR(MATCH($A309&\"#\"&P$1,'[1]Pt1-DATA'!$C:$C,0),0)","v":0},{"$f":"IFERROR(MATCH($A309&\"#\"&Q$1,'[1]Pt1-DATA'!$C:$C,0),0)","v":8269},{"$f":"IFERROR(MATCH($A309&\"#\"&R$1,'[1]Pt1-DATA'!$C:$C,0),0)","v":0},{"$f":"IFERROR(MATCH($A309&\"#\"&S$1,'[1]Pt1-DATA'!$C:$C,0),0)","v":0},{"$f":"IFERROR(MATCH($A309&\"#\"&T$1,'[1]Pt1-DATA'!$C:$C,0),0)","v":0}]
[219,"Regional","Regional Jet","Bombardier CRJ","Bombardier CRJ700-900","General Electric CF34-8C","regional",null,true,null,{"$f":"IFERROR(MATCH($A310&\"#\"&K$1,'[1]Pt1-DATA'!$C:$C,0),0)","v":347},null,{"$f":"IFERROR(MATCH($A310&\"#\"&M$1,'[1]Pt1-DATA'!$C:$C,0),0)","v":0},{"$f":"IFERROR(MATCH($A310&\"#\"&N$1,'[1]Pt1-DATA'!$C:$C,0),0)","v":0},{"$f":"IFERROR(MATCH($A310&\"#\"&O$1,'[1]Pt1-DATA'!$C:$C,0),0)","v":0},{"$f":"IFERROR(MATCH($A310&\"#\"&P$1,'[1]Pt1-DATA'!$C:$C,0),0)","v":0},{"$f":"IFERROR(MATCH($A310&\"#\"&Q$1,'[1]Pt1-DATA'!$C:$C,0),0)","v":8270},{"$f":"IFERROR(MATCH($A310&\"#\"&R$1,'[1]Pt1-DATA'!$C:$C,0),0)","v":0},{"$f":"IFERROR(MATCH($A310&\"#\"&S$1,'[1]Pt1-DATA'!$C:$C,0),0)","v":0},{"$f":"IFERROR(MATCH($A310&\"#\"&T$1,'[1]Pt1-DATA'!$C:$C,0),0)","v":0}]
[27,"Regional","Regional Jet","Comac ARJ21","Comac ARJ21","General Electric CF34-10A","regional",null,true,null,{"$f":"IFERROR(MATCH($A311&\"#\"&K$1,'[1]Pt1-DATA'!$C:$C,0),0)","v":348},null,{"$f":"IFERROR(MATCH($A311&\"#\"&M$1,'[1]Pt1-DATA'!$C:$C,0),0)","v":0},{"$f":"IFERROR(MATCH($A311&\"#\"&N$1,'[1]Pt1-DATA'!$C:$C,0),0)","v":0},{"$f":"IFERROR(MATCH($A311&\"#\"&O$1,'[1]Pt1-DATA'!$C:$C,0),0)","v":0},{"$f":"IFERROR(MATCH($A311&\"#\"&P$1,'[1]Pt1-DATA'!$C:$C,0),0)","v":0},{"$f":"IFERROR(MATCH($A311&\"#\"&Q$1,'[1]Pt1-DATA'!$C:$C,0),0)","v":8284},{"$f":"IFERROR(MATCH($A311&\"#\"&R$1,'[1]Pt1-DATA'!$C:$C,0),0)","v":0},{"$f":"IFERROR(MATCH($A311&\"#\"&S$1,'[1]Pt1-DATA'!$C:$C,0),0)","v":0},{"$f":"IFERROR(MATCH($A311&\"#\"&T$1,'[1]Pt1-DATA'!$C:$C,0),0)","v":0}]
[580,"Regional","Regional Jet","Embraer E170/190","Embraer E170","General Electric CF34-8E","regional",null,true,null,{"$f":"IFERROR(MATCH($A312&\"#\"&K$1,'[1]Pt1-DATA'!$C:$C,0),0)","v":349},null,{"$f":"IFERROR(MATCH($A312&\"#\"&M$1,'[1]Pt1-DATA'!$C:$C,0),0)","v":0},{"$f":"IFERROR(MATCH($A312&\"#\"&N$1,'[1]Pt1-DATA'!$C:$C,0),0)","v":0},{"$f":"IFERROR(MATCH($A312&\"#\"&O$1,'[1]Pt1-DATA'!$C:$C,0),0)","v":0},{"$f":"IFERROR(MATCH($A312&\"#\"&P$1,'[1]Pt1-DATA'!$C:$C,0),0)","v":0},{"$f":"IFERROR(MATCH($A312&\"#\"&Q$1,'[1]Pt1-DATA'!$C:$C,0),0)","v":8285},{"$f":"IFERROR(MATCH($A312&\"#\"&R$1,'[1]Pt1-DATA'!$C:$C,0),0)","v":0},{"$f":"IFERROR(MATCH($A312&\"#\"&S$1,'[1]Pt1-DATA'!$C:$C,0),0)","v":0},{"$f":"IFERROR(MATCH($A312&\"#\"&T$1,'[1]Pt1-DATA'!$C:$C,0),0)","v":0}]
[22,"Regional","Regional Jet","Embraer E170/190","Embraer E175","General Electric CF34-8E","regional",null,true,null,{"$f":"IFERROR(MATCH($A313&\"#\"&K$1,'[1]Pt1-DATA'!$C:$C,0),0)","v":350},null,{"$f":"IFERROR(MATCH($A313&\"#\"&M$1,'[1]Pt1-DATA'!$C:$C,0),0)","v":0},{"$f":"IFERROR(MATCH($A313&\"#\"&N$1,'[1]Pt1-DATA'!$C:$C,0),0)","v":0},{"$f":"IFERROR(MATCH($A313&\"#\"&O$1,'[1]Pt1-DATA'!$C:$C,0),0)","v":0},{"$f":"IFERROR(MATCH($A313&\"#\"&P$1,'[1]Pt1-DATA'!$C:$C,0),0)","v":0},{"$f":"IFERROR(MATCH($A313&\"#\"&Q$1,'[1]Pt1-DATA'!$C:$C,0),0)","v":8286},{"$f":"IFERROR(MATCH($A313&\"#\"&R$1,'[1]Pt1-DATA'!$C:$C,0),0)","v":0},{"$f":"IFERROR(MATCH($A313&\"#\"&S$1,'[1]Pt1-DATA'!$C:$C,0),0)","v":0},{"$f":"IFERROR(MATCH($A313&\"#\"&T$1,'[1]Pt1-DATA'!$C:$C,0),0)","v":0}]
[24,"Regional","Regional Jet","Embraer E170/190","Embraer E175-E2","Pratt & Whitney PW1700G","regional",null,true,null,{"$f":"IFERROR(MATCH($A314&\"#\"&K$1,'[1]Pt1-DATA'!$C:$C,0),0)","v":351},null,{"$f":"IFERROR(MATCH($A314&\"#\"&M$1,'[1]Pt1-DATA'!$C:$C,0),0)","v":0},{"$f":"IFERROR(MATCH($A314&\"#\"&N$1,'[1]Pt1-DATA'!$C:$C,0),0)","v":0},{"$f":"IFERROR(MATCH($A314&\"#\"&O$1,'[1]Pt1-DATA'!$C:$C,0),0)","v":0},{"$f":"IFERROR(MATCH($A314&\"#\"&P$1,'[1]Pt1-DATA'!$C:$C,0),0)","v":0},{"$f":"IFERROR(MATCH($A314&\"#\"&Q$1,'[1]Pt1-DATA'!$C:$C,0),0)","v":8287},{"$f":"IFERROR(MATCH($A314&\"#\"&R$1,'[1]Pt1-DATA'!$C:$C,0),0)","v":0},{"$f":"IFERROR(MATCH($A314&\"#\"&S$1,'[1]Pt1-DATA'!$C:$C,0),0)","v":0},{"$f":"IFERROR(MATCH($A314&\"#\"&T$1,'[1]Pt1-DATA'!$C:$C,0),0)","v":0}]
[23,"Regional","Regional Jet","Embraer E170/190","Embraer E190","General Electric CF34-10E","regional",null,true,null,{"$f":"IFERROR(MATCH($A315&\"#\"&K$1,'[1]Pt1-DATA'!$C:$C,0),0)","v":352},null,{"$f":"IFERROR(MATCH($A315&\"#\"&M$1,'[1]Pt1-DATA'!$C:$C,0),0)","v":0},{"$f":"IFERROR(MATCH($A315&\"#\"&N$1,'[1]Pt1-DATA'!$C:$C,0),0)","v":0},{"$f":"IFERROR(MATCH($A315&\"#\"&O$1,'[1]Pt1-DATA'!$C:$C,0),0)","v":0},{"$f":"IFERROR(MATCH($A315&\"#\"&P$1,'[1]Pt1-DATA'!$C:$C,0),0)","v":0},{"$f":"IFERROR(MATCH($A315&\"#\"&Q$1,'[1]Pt1-DATA'!$C:$C,0),0)","v":8288},{"$f":"IFERROR(MATCH($A315&\"#\"&R$1,'[1]Pt1-DATA'!$C:$C,0),0)","v":0},{"$f":"IFERROR(MATCH($A315&\"#\"&S$1,'[1]Pt1-DATA'!$C:$C,0),0)","v":0},{"$f":"IFERROR(MATCH($A315&\"#\"&T$1,'[1]Pt1-DATA'!$C:$C,0),0)","v":0}]
[25,"Regional","Regional Jet","Embraer E170/190","Embraer E190-E2","Pratt & Whitney PW1900G","regional",null,true,null,{"$f":"IFERROR(MATCH($A316&\"#\"&K$1,'[1]Pt1-DATA'!$C:$C,0),0)","v":353},null,{"$f":"IFERROR(MATCH($A316&\"#\"&M$1,'[1]Pt1-DATA'!$C:$C,0),0)","v":0},{"$f":"IFERROR(MATCH($A316&\"#\"&N$1,'[1]Pt1-DATA'!$C:$C,0),0)","v":0},{"$f":"IFERROR(MATCH($A316&\"#\"&O$1,'[1]Pt1-DATA'!$C:$C,0),0)","v":0},{"$f":"IFERROR(MATCH($A316&\"#\"&P$1,'[1]Pt1-DATA'!$C:$C,0),0)","v":0},{"$f":"IFERROR(MATCH($A316&\"#\"&Q$1,'[1]Pt1-DATA'!$C:$C,0),0)","v":8289},{"$f":"IFERROR(MATCH($A316&\"#\"&R$1,'[1]Pt1-DATA'!$C:$C,0),0)","v":0},{"$f":"IFERROR(MATCH($A316&\"#\"&S$1,'[1]Pt1-DATA'!$C:$C,0),0)","v":0},{"$f":"IFERROR(MATCH($A316&\"#\"&T$1,'[1]Pt1-DATA'!$C:$C,0),0)","v":0}]
[558,"Regional","Regional Jet","Embraer E170/190","Embraer E195","General Electric CF34-10E","regional",null,true,null,{"$f":"IFERROR(MATCH($A317&\"#\"&K$1,'[1]Pt1-DATA'!$C:$C,0),0)","v":354},null,{"$f":"IFERROR(MATCH($A317&\"#\"&M$1,'[1]Pt1-DATA'!$C:$C,0),0)","v":0},{"$f":"IFERROR(MATCH($A317&\"#\"&N$1,'[1]Pt1-DATA'!$C:$C,0),0)","v":0},{"$f":"IFERROR(MATCH($A317&\"#\"&O$1,'[1]Pt1-DATA'!$C:$C,0),0)","v":0},{"$f":"IFERROR(MATCH($A317&\"#\"&P$1,'[1]Pt1-DATA'!$C:$C,0),0)","v":0},{"$f":"IFERROR(MATCH($A317&\"#\"&Q$1,'[1]Pt1-DATA'!$C:$C,0),0)","v":8290},{"$f":"IFERROR(MATCH($A317&\"#\"&R$1,'[1]Pt1-DATA'!$C:$C,0),0)","v":0},{"$f":"IFERROR(MATCH($A317&\"#\"&S$1,'[1]Pt1-DATA'!$C:$C,0),0)","v":0},{"$f":"IFERROR(MATCH($A317&\"#\"&T$1,'[1]Pt1-DATA'!$C:$C,0),0)","v":0}]
[559,"Regional","Regional Jet","Embraer E170/190","Embraer E195-E2","Pratt & Whitney PW1900G","regional",null,true,null,{"$f":"IFERROR(MATCH($A318&\"#\"&K$1,'[1]Pt1-DATA'!$C:$C,0),0)","v":355},null,{"$f":"IFERROR(MATCH($A318&\"#\"&M$1,'[1]Pt1-DATA'!$C:$C,0),0)","v":0},{"$f":"IFERROR(MATCH($A318&\"#\"&N$1,'[1]Pt1-DATA'!$C:$C,0),0)","v":0},{"$f":"IFERROR(MATCH($A318&\"#\"&O$1,'[1]Pt1-DATA'!$C:$C,0),0)","v":0},{"$f":"IFERROR(MATCH($A318&\"#\"&P$1,'[1]Pt1-DATA'!$C:$C,0),0)","v":0},{"$f":"IFERROR(MATCH($A318&\"#\"&Q$1,'[1]Pt1-DATA'!$C:$C,0),0)","v":8291},{"$f":"IFERROR(MATCH($A318&\"#\"&R$1,'[1]Pt1-DATA'!$C:$C,0),0)","v":0},{"$f":"IFERROR(MATCH($A318&\"#\"&S$1,'[1]Pt1-DATA'!$C:$C,0),0)","v":0},{"$f":"IFERROR(MATCH($A318&\"#\"&T$1,'[1]Pt1-DATA'!$C:$C,0),0)","v":0}]
[617,"Regional","Regional Jet","ERJ 135/140/145","Embraer ERJ 135/140/145","Rolls-Royce AE 3007","regional",null,true,null,{"$f":"IFERROR(MATCH($A319&\"#\"&K$1,'[1]Pt1-DATA'!$C:$C,0),0)","v":356},null,{"$f":"IFERROR(MATCH($A319&\"#\"&M$1,'[1]Pt1-DATA'!$C:$C,0),0)","v":0},{"$f":"IFERROR(MATCH($A319&\"#\"&N$1,'[1]Pt1-DATA'!$C:$C,0),0)","v":0},{"$f":"IFERROR(MATCH($A319&\"#\"&O$1,'[1]Pt1-DATA'!$C:$C,0),0)","v":0},{"$f":"IFERROR(MATCH($A319&\"#\"&P$1,'[1]Pt1-DATA'!$C:$C,0),0)","v":0},{"$f":"IFERROR(MATCH($A319&\"#\"&Q$1,'[1]Pt1-DATA'!$C:$C,0),0)","v":8271},{"$f":"IFERROR(MATCH($A319&\"#\"&R$1,'[1]Pt1-DATA'!$C:$C,0),0)","v":0},{"$f":"IFERROR(MATCH($A319&\"#\"&S$1,'[1]Pt1-DATA'!$C:$C,0),0)","v":0},{"$f":"IFERROR(MATCH($A319&\"#\"&T$1,'[1]Pt1-DATA'!$C:$C,0),0)","v":0}]
[29,"Regional","Regional Jet","Sukhoi Superjet","Sukhoi Superjet 100","PowerJet SaM146","regional",null,true,null,{"$f":"IFERROR(MATCH($A320&\"#\"&K$1,'[1]Pt1-DATA'!$C:$C,0),0)","v":357},null,{"$f":"IFERROR(MATCH($A320&\"#\"&M$1,'[1]Pt1-DATA'!$C:$C,0),0)","v":0},{"$f":"IFERROR(MATCH($A320&\"#\"&N$1,'[1]Pt1-DATA'!$C:$C,0),0)","v":0},{"$f":"IFERROR(MATCH($A320&\"#\"&O$1,'[1]Pt1-DATA'!$C:$C,0),0)","v":0},{"$f":"IFERROR(MATCH($A320&\"#\"&P$1,'[1]Pt1-DATA'!$C:$C,0),0)","v":0},{"$f":"IFERROR(MATCH($A320&\"#\"&Q$1,'[1]Pt1-DATA'!$C:$C,0),0)","v":8292},{"$f":"IFERROR(MATCH($A320&\"#\"&R$1,'[1]Pt1-DATA'!$C:$C,0),0)","v":0},{"$f":"IFERROR(MATCH($A320&\"#\"&S$1,'[1]Pt1-DATA'!$C:$C,0),0)","v":0},{"$f":"IFERROR(MATCH($A320&\"#\"&T$1,'[1]Pt1-DATA'!$C:$C,0),0)","v":0}]
[191,"Regional","Regional Turboprop","ATR 42/72","ATR 42","Pratt & Whitney Canada PW120","regional","wide body (IMA)",true,null,{"$f":"IFERROR(MATCH($A321&\"#\"&K$1,'[1]Pt1-DATA'!$C:$C,0),0)","v":358},null,{"$f":"IFERROR(MATCH($A321&\"#\"&M$1,'[1]Pt1-DATA'!$C:$C,0),0)","v":0},{"$f":"IFERROR(MATCH($A321&\"#\"&N$1,'[1]Pt1-DATA'!$C:$C,0),0)","v":7390},{"$f":"IFERROR(MATCH($A321&\"#\"&O$1,'[1]Pt1-DATA'!$C:$C,0),0)","v":0},{"$f":"IFERROR(MATCH($A321&\"#\"&P$1,'[1]Pt1-DATA'!$C:$C,0),0)","v":0},{"$f":"IFERROR(MATCH($A321&\"#\"&Q$1,'[1]Pt1-DATA'!$C:$C,0),0)","v":8272},{"$f":"IFERROR(MATCH($A321&\"#\"&R$1,'[1]Pt1-DATA'!$C:$C,0),0)","v":0},{"$f":"IFERROR(MATCH($A321&\"#\"&S$1,'[1]Pt1-DATA'!$C:$C,0),0)","v":0},{"$f":"IFERROR(MATCH($A321&\"#\"&T$1,'[1]Pt1-DATA'!$C:$C,0),0)","v":0}]
[26,"Regional","Regional Turboprop","ATR 42/72","ATR 72","Pratt & Whitney Canada PW120","regional",null,true,null,{"$f":"IFERROR(MATCH($A322&\"#\"&K$1,'[1]Pt1-DATA'!$C:$C,0),0)","v":359},null,{"$f":"IFERROR(MATCH($A322&\"#\"&M$1,'[1]Pt1-DATA'!$C:$C,0),0)","v":0},{"$f":"IFERROR(MATCH($A322&\"#\"&N$1,'[1]Pt1-DATA'!$C:$C,0),0)","v":7391},{"$f":"IFERROR(MATCH($A322&\"#\"&O$1,'[1]Pt1-DATA'!$C:$C,0),0)","v":0},{"$f":"IFERROR(MATCH($A322&\"#\"&P$1,'[1]Pt1-DATA'!$C:$C,0),0)","v":0},{"$f":"IFERROR(MATCH($A322&\"#\"&Q$1,'[1]Pt1-DATA'!$C:$C,0),0)","v":8273},{"$f":"IFERROR(MATCH($A322&\"#\"&R$1,'[1]Pt1-DATA'!$C:$C,0),0)","v":0},{"$f":"IFERROR(MATCH($A322&\"#\"&S$1,'[1]Pt1-DATA'!$C:$C,0),0)","v":0},{"$f":"IFERROR(MATCH($A322&\"#\"&T$1,'[1]Pt1-DATA'!$C:$C,0),0)","v":0}]
[647,"Regional","Regional Turboprop","ATR 42/72X","ATR 42/72X","Pratt & Whitney Canada PW120","regional","wide body (IMA)",{"$f":"SUM(K323:T323)>0","v":true},null,{"$f":"IFERROR(MATCH($A323&\"#\"&K$1,'[1]Pt1-DATA'!$C:$C,0),0)","v":360},null,{"$f":"IFERROR(MATCH($A323&\"#\"&M$1,'[1]Pt1-DATA'!$C:$C,0),0)","v":0},{"$f":"IFERROR(MATCH($A323&\"#\"&N$1,'[1]Pt1-DATA'!$C:$C,0),0)","v":7392},{"$f":"IFERROR(MATCH($A323&\"#\"&O$1,'[1]Pt1-DATA'!$C:$C,0),0)","v":0},{"$f":"IFERROR(MATCH($A323&\"#\"&P$1,'[1]Pt1-DATA'!$C:$C,0),0)","v":0},{"$f":"IFERROR(MATCH($A323&\"#\"&Q$1,'[1]Pt1-DATA'!$C:$C,0),0)","v":8274},{"$f":"IFERROR(MATCH($A323&\"#\"&R$1,'[1]Pt1-DATA'!$C:$C,0),0)","v":0},{"$f":"IFERROR(MATCH($A323&\"#\"&S$1,'[1]Pt1-DATA'!$C:$C,0),0)","v":0},{"$f":"IFERROR(MATCH($A323&\"#\"&T$1,'[1]Pt1-DATA'!$C:$C,0),0)","v":0}]
[616,"Regional","Regional Turboprop","AVIC MA700","AVIC MA700","Pratt & Whitney Canada PW150C","regional",null,true,null,{"$f":"IFERROR(MATCH($A324&\"#\"&K$1,'[1]Pt1-DATA'!$C:$C,0),0)","v":361},null,{"$f":"IFERROR(MATCH($A324&\"#\"&M$1,'[1]Pt1-DATA'!$C:$C,0),0)","v":0},{"$f":"IFERROR(MATCH($A324&\"#\"&N$1,'[1]Pt1-DATA'!$C:$C,0),0)","v":0},{"$f":"IFERROR(MATCH($A324&\"#\"&O$1,'[1]Pt1-DATA'!$C:$C,0),0)","v":0},{"$f":"IFERROR(MATCH($A324&\"#\"&P$1,'[1]Pt1-DATA'!$C:$C,0),0)","v":0},{"$f":"IFERROR(MATCH($A324&\"#\"&Q$1,'[1]Pt1-DATA'!$C:$C,0),0)","v":8275},{"$f":"IFERROR(MATCH($A324&\"#\"&R$1,'[1]Pt1-DATA'!$C:$C,0),0)","v":0},{"$f":"IFERROR(MATCH($A324&\"#\"&S$1,'[1]Pt1-DATA'!$C:$C,0),0)","v":0},{"$f":"IFERROR(MATCH($A324&\"#\"&T$1,'[1]Pt1-DATA'!$C:$C,0),0)","v":0}]
[621,"Regional","Regional Turboprop","De Havilland Canada DHC-8","De Havilland Canada DHC-8-100","Pratt & Whitney Canada PW120","regional",null,true,null,{"$f":"IFERROR(MATCH($A325&\"#\"&K$1,'[1]Pt1-DATA'!$C:$C,0),0)","v":362},null,{"$f":"IFERROR(MATCH($A325&\"#\"&M$1,'[1]Pt1-DATA'!$C:$C,0),0)","v":0},{"$f":"IFERROR(MATCH($A325&\"#\"&N$1,'[1]Pt1-DATA'!$C:$C,0),0)","v":0},{"$f":"IFERROR(MATCH($A325&\"#\"&O$1,'[1]Pt1-DATA'!$C:$C,0),0)","v":0},{"$f":"IFERROR(MATCH($A325&\"#\"&P$1,'[1]Pt1-DATA'!$C:$C,0),0)","v":0},{"$f":"IFERROR(MATCH($A325&\"#\"&Q$1,'[1]Pt1-DATA'!$C:$C,0),0)","v":8276},{"$f":"IFERROR(MATCH($A325&\"#\"&R$1,'[1]Pt1-DATA'!$C:$C,0),0)","v":0},{"$f":"IFERROR(MATCH($A325&\"#\"&S$1,'[1]Pt1-DATA'!$C:$C,0),0)","v":0},{"$f":"IFERROR(MATCH($A325&\"#\"&T$1,'[1]Pt1-DATA'!$C:$C,0),0)","v":0}]
[622,"Regional","Regional Turboprop","De Havilland Canada DHC-8","De Havilland Canada DHC-8-200","Pratt & Whitney Canada PW120","regional",null,true,null,{"$f":"IFERROR(MATCH($A326&\"#\"&K$1,'[1]Pt1-DATA'!$C:$C,0),0)","v":363},null,{"$f":"IFERROR(MATCH($A326&\"#\"&M$1,'[1]Pt1-DATA'!$C:$C,0),0)","v":0},{"$f":"IFERROR(MATCH($A326&\"#\"&N$1,'[1]Pt1-DATA'!$C:$C,0),0)","v":0},{"$f":"IFERROR(MATCH($A326&\"#\"&O$1,'[1]Pt1-DATA'!$C:$C,0),0)","v":0},{"$f":"IFERROR(MATCH($A326&\"#\"&P$1,'[1]Pt1-DATA'!$C:$C,0),0)","v":0},{"$f":"IFERROR(MATCH($A326&\"#\"&Q$1,'[1]Pt1-DATA'!$C:$C,0),0)","v":8277},{"$f":"IFERROR(MATCH($A326&\"#\"&R$1,'[1]Pt1-DATA'!$C:$C,0),0)","v":0},{"$f":"IFERROR(MATCH($A326&\"#\"&S$1,'[1]Pt1-DATA'!$C:$C,0),0)","v":0},{"$f":"IFERROR(MATCH($A326&\"#\"&T$1,'[1]Pt1-DATA'!$C:$C,0),0)","v":0}]
[623,"Regional","Regional Turboprop","De Havilland Canada DHC-8","De Havilland Canada DHC-8-300","Pratt & Whitney Canada PW120","regional",null,true,null,{"$f":"IFERROR(MATCH($A327&\"#\"&K$1,'[1]Pt1-DATA'!$C:$C,0),0)","v":364},null,{"$f":"IFERROR(MATCH($A327&\"#\"&M$1,'[1]Pt1-DATA'!$C:$C,0),0)","v":0},{"$f":"IFERROR(MATCH($A327&\"#\"&N$1,'[1]Pt1-DATA'!$C:$C,0),0)","v":0},{"$f":"IFERROR(MATCH($A327&\"#\"&O$1,'[1]Pt1-DATA'!$C:$C,0),0)","v":0},{"$f":"IFERROR(MATCH($A327&\"#\"&P$1,'[1]Pt1-DATA'!$C:$C,0),0)","v":0},{"$f":"IFERROR(MATCH($A327&\"#\"&Q$1,'[1]Pt1-DATA'!$C:$C,0),0)","v":8278},{"$f":"IFERROR(MATCH($A327&\"#\"&R$1,'[1]Pt1-DATA'!$C:$C,0),0)","v":0},{"$f":"IFERROR(MATCH($A327&\"#\"&S$1,'[1]Pt1-DATA'!$C:$C,0),0)","v":0},{"$f":"IFERROR(MATCH($A327&\"#\"&T$1,'[1]Pt1-DATA'!$C:$C,0),0)","v":0}]
[21,"Regional","Regional Turboprop","De Havilland Canada DHC-8","De Havilland Canada DHC-8-400","Pratt & Whitney Canada PW150A","regional",null,true,null,{"$f":"IFERROR(MATCH($A328&\"#\"&K$1,'[1]Pt1-DATA'!$C:$C,0),0)","v":365},null,{"$f":"IFERROR(MATCH($A328&\"#\"&M$1,'[1]Pt1-DATA'!$C:$C,0),0)","v":0},{"$f":"IFERROR(MATCH($A328&\"#\"&N$1,'[1]Pt1-DATA'!$C:$C,0),0)","v":0},{"$f":"IFERROR(MATCH($A328&\"#\"&O$1,'[1]Pt1-DATA'!$C:$C,0),0)","v":0},{"$f":"IFERROR(MATCH($A328&\"#\"&P$1,'[1]Pt1-DATA'!$C:$C,0),0)","v":0},{"$f":"IFERROR(MATCH($A328&\"#\"&Q$1,'[1]Pt1-DATA'!$C:$C,0),0)","v":8279},{"$f":"IFERROR(MATCH($A328&\"#\"&R$1,'[1]Pt1-DATA'!$C:$C,0),0)","v":0},{"$f":"IFERROR(MATCH($A328&\"#\"&S$1,'[1]Pt1-DATA'!$C:$C,0),0)","v":0},{"$f":"IFERROR(MATCH($A328&\"#\"&T$1,'[1]Pt1-DATA'!$C:$C,0),0)","v":0}]
[624,"Regional","Regional Turboprop","Dornier Do 328-100","Dornier Do 328-100","Pratt & Whitney Canada PW120","regional",null,true,null,{"$f":"IFERROR(MATCH($A329&\"#\"&K$1,'[1]Pt1-DATA'!$C:$C,0),0)","v":366},null,{"$f":"IFERROR(MATCH($A329&\"#\"&M$1,'[1]Pt1-DATA'!$C:$C,0),0)","v":0},{"$f":"IFERROR(MATCH($A329&\"#\"&N$1,'[1]Pt1-DATA'!$C:$C,0),0)","v":0},{"$f":"IFERROR(MATCH($A329&\"#\"&O$1,'[1]Pt1-DATA'!$C:$C,0),0)","v":0},{"$f":"IFERROR(MATCH($A329&\"#\"&P$1,'[1]Pt1-DATA'!$C:$C,0),0)","v":0},{"$f":"IFERROR(MATCH($A329&\"#\"&Q$1,'[1]Pt1-DATA'!$C:$C,0),0)","v":8280},{"$f":"IFERROR(MATCH($A329&\"#\"&R$1,'[1]Pt1-DATA'!$C:$C,0),0)","v":0},{"$f":"IFERROR(MATCH($A329&\"#\"&S$1,'[1]Pt1-DATA'!$C:$C,0),0)","v":0},{"$f":"IFERROR(MATCH($A329&\"#\"&T$1,'[1]Pt1-DATA'!$C:$C,0),0)","v":0}]
[613,"Regional","Regional Turboprop","Embraer ","New Embraer turboprop","Pratt & Whitney Canada PW120","regional",null,true,null,{"$f":"IFERROR(MATCH($A330&\"#\"&K$1,'[1]Pt1-DATA'!$C:$C,0),0)","v":367},null,{"$f":"IFERROR(MATCH($A330&\"#\"&M$1,'[1]Pt1-DATA'!$C:$C,0),0)","v":0},{"$f":"IFERROR(MATCH($A330&\"#\"&N$1,'[1]Pt1-DATA'!$C:$C,0),0)","v":0},{"$f":"IFERROR(MATCH($A330&\"#\"&O$1,'[1]Pt1-DATA'!$C:$C,0),0)","v":0},{"$f":"IFERROR(MATCH($A330&\"#\"&P$1,'[1]Pt1-DATA'!$C:$C,0),0)","v":0},{"$f":"IFERROR(MATCH($A330&\"#\"&Q$1,'[1]Pt1-DATA'!$C:$C,0),0)","v":8281},{"$f":"IFERROR(MATCH($A330&\"#\"&R$1,'[1]Pt1-DATA'!$C:$C,0),0)","v":0},{"$f":"IFERROR(MATCH($A330&\"#\"&S$1,'[1]Pt1-DATA'!$C:$C,0),0)","v":0},{"$f":"IFERROR(MATCH($A330&\"#\"&T$1,'[1]Pt1-DATA'!$C:$C,0),0)","v":0}]
[625,"Regional","Regional Turboprop","Xian MA60","Xian MA60","Pratt & Whitney Canada PW120","regional",null,true,null,{"$f":"IFERROR(MATCH($A331&\"#\"&K$1,'[1]Pt1-DATA'!$C:$C,0),0)","v":368},null,{"$f":"IFERROR(MATCH($A331&\"#\"&M$1,'[1]Pt1-DATA'!$C:$C,0),0)","v":0},{"$f":"IFERROR(MATCH($A331&\"#\"&N$1,'[1]Pt1-DATA'!$C:$C,0),0)","v":0},{"$f":"IFERROR(MATCH($A331&\"#\"&O$1,'[1]Pt1-DATA'!$C:$C,0),0)","v":0},{"$f":"IFERROR(MATCH($A331&\"#\"&P$1,'[1]Pt1-DATA'!$C:$C,0),0)","v":0},{"$f":"IFERROR(MATCH($A331&\"#\"&Q$1,'[1]Pt1-DATA'!$C:$C,0),0)","v":8282},{"$f":"IFERROR(MATCH($A331&\"#\"&R$1,'[1]Pt1-DATA'!$C:$C,0),0)","v":0},{"$f":"IFERROR(MATCH($A331&\"#\"&S$1,'[1]Pt1-DATA'!$C:$C,0),0)","v":0},{"$f":"IFERROR(MATCH($A331&\"#\"&T$1,'[1]Pt1-DATA'!$C:$C,0),0)","v":0}]
[544,"Turbine GA","Turbine GA","Air Tractor","Air Tractor","Pratt & Whitney Canada PT6A",null,null,false,null,{"$f":"IFERROR(MATCH($A332&\"#\"&K$1,'[1]Pt1-DATA'!$C:$C,0),0)","v":0},null,{"$f":"IFERROR(MATCH($A332&\"#\"&M$1,'[1]Pt1-DATA'!$C:$C,0),0)","v":0},{"$f":"IFERROR(MATCH($A332&\"#\"&N$1,'[1]Pt1-DATA'!$C:$C,0),0)","v":0},{"$f":"IFERROR(MATCH($A332&\"#\"&O$1,'[1]Pt1-DATA'!$C:$C,0),0)","v":0},{"$f":"IFERROR(MATCH($A332&\"#\"&P$1,'[1]Pt1-DATA'!$C:$C,0),0)","v":0},{"$f":"IFERROR(MATCH($A332&\"#\"&Q$1,'[1]Pt1-DATA'!$C:$C,0),0)","v":0},{"$f":"IFERROR(MATCH($A332&\"#\"&R$1,'[1]Pt1-DATA'!$C:$C,0),0)","v":0},{"$f":"IFERROR(MATCH($A332&\"#\"&S$1,'[1]Pt1-DATA'!$C:$C,0),0)","v":0},{"$f":"IFERROR(MATCH($A332&\"#\"&T$1,'[1]Pt1-DATA'!$C:$C,0),0)","v":0}]
[545,"Turbine GA","Turbine GA","Airvan 10","GippsAero GA10 Airvan","Allison Model 250 (B)",null,null,false,null,{"$f":"IFERROR(MATCH($A333&\"#\"&K$1,'[1]Pt1-DATA'!$C:$C,0),0)","v":0},null,{"$f":"IFERROR(MATCH($A333&\"#\"&M$1,'[1]Pt1-DATA'!$C:$C,0),0)","v":0},{"$f":"IFERROR(MATCH($A333&\"#\"&N$1,'[1]Pt1-DATA'!$C:$C,0),0)","v":0},{"$f":"IFERROR(MATCH($A333&\"#\"&O$1,'[1]Pt1-DATA'!$C:$C,0),0)","v":0},{"$f":"IFERROR(MATCH($A333&\"#\"&P$1,'[1]Pt1-DATA'!$C:$C,0),0)","v":0},{"$f":"IFERROR(MATCH($A333&\"#\"&Q$1,'[1]Pt1-DATA'!$C:$C,0),0)","v":0},{"$f":"IFERROR(MATCH($A333&\"#\"&R$1,'[1]Pt1-DATA'!$C:$C,0),0)","v":0},{"$f":"IFERROR(MATCH($A333&\"#\"&S$1,'[1]Pt1-DATA'!$C:$C,0),0)","v":0},{"$f":"IFERROR(MATCH($A333&\"#\"&T$1,'[1]Pt1-DATA'!$C:$C,0),0)","v":0}]
[548,"Turbine GA","Turbine GA","Ayres Thrush 510","Ayres Thrush 510","General Electric H80",null,null,false,null,{"$f":"IFERROR(MATCH($A334&\"#\"&K$1,'[1]Pt1-DATA'!$C:$C,0),0)","v":0},null,{"$f":"IFERROR(MATCH($A334&\"#\"&M$1,'[1]Pt1-DATA'!$C:$C,0),0)","v":0},{"$f":"IFERROR(MATCH($A334&\"#\"&N$1,'[1]Pt1-DATA'!$C:$C,0),0)","v":0},{"$f":"IFERROR(MATCH($A334&\"#\"&O$1,'[1]Pt1-DATA'!$C:$C,0),0)","v":0},{"$f":"IFERROR(MATCH($A334&\"#\"&P$1,'[1]Pt1-DATA'!$C:$C,0),0)","v":0},{"$f":"IFERROR(MATCH($A334&\"#\"&Q$1,'[1]Pt1-DATA'!$C:$C,0),0)","v":0},{"$f":"IFERROR(MATCH($A334&\"#\"&R$1,'[1]Pt1-DATA'!$C:$C,0),0)","v":0},{"$f":"IFERROR(MATCH($A334&\"#\"&S$1,'[1]Pt1-DATA'!$C:$C,0),0)","v":0},{"$f":"IFERROR(MATCH($A334&\"#\"&T$1,'[1]Pt1-DATA'!$C:$C,0),0)","v":0}]
[549,"Turbine GA","Turbine GA","Ayres Thrush SR2","Ayres Thrush SR2","Pratt & Whitney Canada PT6A",null,null,false,null,{"$f":"IFERROR(MATCH($A335&\"#\"&K$1,'[1]Pt1-DATA'!$C:$C,0),0)","v":0},null,{"$f":"IFERROR(MATCH($A335&\"#\"&M$1,'[1]Pt1-DATA'!$C:$C,0),0)","v":0},{"$f":"IFERROR(MATCH($A335&\"#\"&N$1,'[1]Pt1-DATA'!$C:$C,0),0)","v":0},{"$f":"IFERROR(MATCH($A335&\"#\"&O$1,'[1]Pt1-DATA'!$C:$C,0),0)","v":0},{"$f":"IFERROR(MATCH($A335&\"#\"&P$1,'[1]Pt1-DATA'!$C:$C,0),0)","v":0},{"$f":"IFERROR(MATCH($A335&\"#\"&Q$1,'[1]Pt1-DATA'!$C:$C,0),0)","v":0},{"$f":"IFERROR(MATCH($A335&\"#\"&R$1,'[1]Pt1-DATA'!$C:$C,0),0)","v":0},{"$f":"IFERROR(MATCH($A335&\"#\"&S$1,'[1]Pt1-DATA'!$C:$C,0),0)","v":0},{"$f":"IFERROR(MATCH($A335&\"#\"&T$1,'[1]Pt1-DATA'!$C:$C,0),0)","v":0}]
[80,"Turbine GA","Turbine GA","Beechcraft King Air","Beechcraft King Air","Pratt & Whitney Canada PT6A",null,null,false,null,{"$f":"IFERROR(MATCH($A336&\"#\"&K$1,'[1]Pt1-DATA'!$C:$C,0),0)","v":0},null,{"$f":"IFERROR(MATCH($A336&\"#\"&M$1,'[1]Pt1-DATA'!$C:$C,0),0)","v":0},{"$f":"IFERROR(MATCH($A336&\"#\"&N$1,'[1]Pt1-DATA'!$C:$C,0),0)","v":0},{"$f":"IFERROR(MATCH($A336&\"#\"&O$1,'[1]Pt1-DATA'!$C:$C,0),0)","v":0},{"$f":"IFERROR(MATCH($A336&\"#\"&P$1,'[1]Pt1-DATA'!$C:$C,0),0)","v":0},{"$f":"IFERROR(MATCH($A336&\"#\"&Q$1,'[1]Pt1-DATA'!$C:$C,0),0)","v":0},{"$f":"IFERROR(MATCH($A336&\"#\"&R$1,'[1]Pt1-DATA'!$C:$C,0),0)","v":0},{"$f":"IFERROR(MATCH($A336&\"#\"&S$1,'[1]Pt1-DATA'!$C:$C,0),0)","v":0},{"$f":"IFERROR(MATCH($A336&\"#\"&T$1,'[1]Pt1-DATA'!$C:$C,0),0)","v":0}]
[226,"Turbine GA","Turbine GA","Canadair CL-415","Canadair CL-415","Pratt & Whitney Canada PW120","",null,true,null,{"$f":"IFERROR(MATCH($A337&\"#\"&K$1,'[1]Pt1-DATA'!$C:$C,0),0)","v":369},null,{"$f":"IFERROR(MATCH($A337&\"#\"&M$1,'[1]Pt1-DATA'!$C:$C,0),0)","v":0},{"$f":"IFERROR(MATCH($A337&\"#\"&N$1,'[1]Pt1-DATA'!$C:$C,0),0)","v":0},{"$f":"IFERROR(MATCH($A337&\"#\"&O$1,'[1]Pt1-DATA'!$C:$C,0),0)","v":0},{"$f":"IFERROR(MATCH($A337&\"#\"&P$1,'[1]Pt1-DATA'!$C:$C,0),0)","v":0},{"$f":"IFERROR(MATCH($A337&\"#\"&Q$1,'[1]Pt1-DATA'!$C:$C,0),0)","v":8283},{"$f":"IFERROR(MATCH($A337&\"#\"&R$1,'[1]Pt1-DATA'!$C:$C,0),0)","v":0},{"$f":"IFERROR(MATCH($A337&\"#\"&S$1,'[1]Pt1-DATA'!$C:$C,0),0)","v":0},{"$f":"IFERROR(MATCH($A337&\"#\"&T$1,'[1]Pt1-DATA'!$C:$C,0),0)","v":0}]
[82,"Turbine GA","Turbine GA","Cessna 208 Caravan","Cessna 208 Caravan","Pratt & Whitney Canada PT6A",null,null,false,null,{"$f":"IFERROR(MATCH($A338&\"#\"&K$1,'[1]Pt1-DATA'!$C:$C,0),0)","v":0},null,{"$f":"IFERROR(MATCH($A338&\"#\"&M$1,'[1]Pt1-DATA'!$C:$C,0),0)","v":0},{"$f":"IFERROR(MATCH($A338&\"#\"&N$1,'[1]Pt1-DATA'!$C:$C,0),0)","v":0},{"$f":"IFERROR(MATCH($A338&\"#\"&O$1,'[1]Pt1-DATA'!$C:$C,0),0)","v":0},{"$f":"IFERROR(MATCH($A338&\"#\"&P$1,'[1]Pt1-DATA'!$C:$C,0),0)","v":0},{"$f":"IFERROR(MATCH($A338&\"#\"&Q$1,'[1]Pt1-DATA'!$C:$C,0),0)","v":0},{"$f":"IFERROR(MATCH($A338&\"#\"&R$1,'[1]Pt1-DATA'!$C:$C,0),0)","v":0},{"$f":"IFERROR(MATCH($A338&\"#\"&S$1,'[1]Pt1-DATA'!$C:$C,0),0)","v":0},{"$f":"IFERROR(MATCH($A338&\"#\"&T$1,'[1]Pt1-DATA'!$C:$C,0),0)","v":0}]
[308,"Turbine GA","Turbine GA","Cessna 408 SkyCourier","Cessna 408 SkyCourier","Pratt & Whitney Canada PT6A",null,null,false,null,{"$f":"IFERROR(MATCH($A339&\"#\"&K$1,'[1]Pt1-DATA'!$C:$C,0),0)","v":0},null,{"$f":"IFERROR(MATCH($A339&\"#\"&M$1,'[1]Pt1-DATA'!$C:$C,0),0)","v":0},{"$f":"IFERROR(MATCH($A339&\"#\"&N$1,'[1]Pt1-DATA'!$C:$C,0),0)","v":0},{"$f":"IFERROR(MATCH($A339&\"#\"&O$1,'[1]Pt1-DATA'!$C:$C,0),0)","v":0},{"$f":"IFERROR(MATCH($A339&\"#\"&P$1,'[1]Pt1-DATA'!$C:$C,0),0)","v":0},{"$f":"IFERROR(MATCH($A339&\"#\"&Q$1,'[1]Pt1-DATA'!$C:$C,0),0)","v":0},{"$f":"IFERROR(MATCH($A339&\"#\"&R$1,'[1]Pt1-DATA'!$C:$C,0),0)","v":0},{"$f":"IFERROR(MATCH($A339&\"#\"&S$1,'[1]Pt1-DATA'!$C:$C,0),0)","v":0},{"$f":"IFERROR(MATCH($A339&\"#\"&T$1,'[1]Pt1-DATA'!$C:$C,0),0)","v":0}]
[81,"Turbine GA","Turbine GA","Cessna Denali","Cessna Denali","General Electric Catalyst",null,null,false,null,{"$f":"IFERROR(MATCH($A340&\"#\"&K$1,'[1]Pt1-DATA'!$C:$C,0),0)","v":0},null,{"$f":"IFERROR(MATCH($A340&\"#\"&M$1,'[1]Pt1-DATA'!$C:$C,0),0)","v":0},{"$f":"IFERROR(MATCH($A340&\"#\"&N$1,'[1]Pt1-DATA'!$C:$C,0),0)","v":0},{"$f":"IFERROR(MATCH($A340&\"#\"&O$1,'[1]Pt1-DATA'!$C:$C,0),0)","v":0},{"$f":"IFERROR(MATCH($A340&\"#\"&P$1,'[1]Pt1-DATA'!$C:$C,0),0)","v":0},{"$f":"IFERROR(MATCH($A340&\"#\"&Q$1,'[1]Pt1-DATA'!$C:$C,0),0)","v":0},{"$f":"IFERROR(MATCH($A340&\"#\"&R$1,'[1]Pt1-DATA'!$C:$C,0),0)","v":0},{"$f":"IFERROR(MATCH($A340&\"#\"&S$1,'[1]Pt1-DATA'!$C:$C,0),0)","v":0},{"$f":"IFERROR(MATCH($A340&\"#\"&T$1,'[1]Pt1-DATA'!$C:$C,0),0)","v":0}]
[224,"Turbine GA","Turbine GA","Dornier Do 228","Dornier Do 228","Honeywell TPE331",null,null,false,null,{"$f":"IFERROR(MATCH($A341&\"#\"&K$1,'[1]Pt1-DATA'!$C:$C,0),0)","v":0},null,{"$f":"IFERROR(MATCH($A341&\"#\"&M$1,'[1]Pt1-DATA'!$C:$C,0),0)","v":0},{"$f":"IFERROR(MATCH($A341&\"#\"&N$1,'[1]Pt1-DATA'!$C:$C,0),0)","v":0},{"$f":"IFERROR(MATCH($A341&\"#\"&O$1,'[1]Pt1-DATA'!$C:$C,0),0)","v":0},{"$f":"IFERROR(MATCH($A341&\"#\"&P$1,'[1]Pt1-DATA'!$C:$C,0),0)","v":0},{"$f":"IFERROR(MATCH($A341&\"#\"&Q$1,'[1]Pt1-DATA'!$C:$C,0),0)","v":0},{"$f":"IFERROR(MATCH($A341&\"#\"&R$1,'[1]Pt1-DATA'!$C:$C,0),0)","v":0},{"$f":"IFERROR(MATCH($A341&\"#\"&S$1,'[1]Pt1-DATA'!$C:$C,0),0)","v":0},{"$f":"IFERROR(MATCH($A341&\"#\"&T$1,'[1]Pt1-DATA'!$C:$C,0),0)","v":0}]
[680,"Turbine GA","Turbine GA","Epic E1000","Epic E1000GX","Pratt & Whitney Canada PT6A",null,null,false,null,{"$f":"IFERROR(MATCH($A342&\"#\"&K$1,'[1]Pt1-DATA'!$C:$C,0),0)","v":0},null,{"$f":"IFERROR(MATCH($A342&\"#\"&M$1,'[1]Pt1-DATA'!$C:$C,0),0)","v":0},{"$f":"IFERROR(MATCH($A342&\"#\"&N$1,'[1]Pt1-DATA'!$C:$C,0),0)","v":0},{"$f":"IFERROR(MATCH($A342&\"#\"&O$1,'[1]Pt1-DATA'!$C:$C,0),0)","v":0},{"$f":"IFERROR(MATCH($A342&\"#\"&P$1,'[1]Pt1-DATA'!$C:$C,0),0)","v":0},{"$f":"IFERROR(MATCH($A342&\"#\"&Q$1,'[1]Pt1-DATA'!$C:$C,0),0)","v":0},{"$f":"IFERROR(MATCH($A342&\"#\"&R$1,'[1]Pt1-DATA'!$C:$C,0),0)","v":0},{"$f":"IFERROR(MATCH($A342&\"#\"&S$1,'[1]Pt1-DATA'!$C:$C,0),0)","v":0},{"$f":"IFERROR(MATCH($A342&\"#\"&T$1,'[1]Pt1-DATA'!$C:$C,0),0)","v":0}]
[225,"Turbine GA","Turbine GA","Let L-410 Turbolet","Let L-410 Turbolet","General Electric H80",null,null,false,null,{"$f":"IFERROR(MATCH($A343&\"#\"&K$1,'[1]Pt1-DATA'!$C:$C,0),0)","v":0},null,{"$f":"IFERROR(MATCH($A343&\"#\"&M$1,'[1]Pt1-DATA'!$C:$C,0),0)","v":0},{"$f":"IFERROR(MATCH($A343&\"#\"&N$1,'[1]Pt1-DATA'!$C:$C,0),0)","v":0},{"$f":"IFERROR(MATCH($A343&\"#\"&O$1,'[1]Pt1-DATA'!$C:$C,0),0)","v":0},{"$f":"IFERROR(MATCH($A343&\"#\"&P$1,'[1]Pt1-DATA'!$C:$C,0),0)","v":0},{"$f":"IFERROR(MATCH($A343&\"#\"&Q$1,'[1]Pt1-DATA'!$C:$C,0),0)","v":0},{"$f":"IFERROR(MATCH($A343&\"#\"&R$1,'[1]Pt1-DATA'!$C:$C,0),0)","v":0},{"$f":"IFERROR(MATCH($A343&\"#\"&S$1,'[1]Pt1-DATA'!$C:$C,0),0)","v":0},{"$f":"IFERROR(MATCH($A343&\"#\"&T$1,'[1]Pt1-DATA'!$C:$C,0),0)","v":0}]
[679,"Turbine GA","Turbine GA","N-219","Indonesian Aerospace N-219 Nurtanio","Pratt & Whitney Canada PT6A",null,null,false,null,{"$f":"IFERROR(MATCH($A344&\"#\"&K$1,'[1]Pt1-DATA'!$C:$C,0),0)","v":0},null,{"$f":"IFERROR(MATCH($A344&\"#\"&M$1,'[1]Pt1-DATA'!$C:$C,0),0)","v":0},{"$f":"IFERROR(MATCH($A344&\"#\"&N$1,'[1]Pt1-DATA'!$C:$C,0),0)","v":0},{"$f":"IFERROR(MATCH($A344&\"#\"&O$1,'[1]Pt1-DATA'!$C:$C,0),0)","v":0},{"$f":"IFERROR(MATCH($A344&\"#\"&P$1,'[1]Pt1-DATA'!$C:$C,0),0)","v":0},{"$f":"IFERROR(MATCH($A344&\"#\"&Q$1,'[1]Pt1-DATA'!$C:$C,0),0)","v":0},{"$f":"IFERROR(MATCH($A344&\"#\"&R$1,'[1]Pt1-DATA'!$C:$C,0),0)","v":0},{"$f":"IFERROR(MATCH($A344&\"#\"&S$1,'[1]Pt1-DATA'!$C:$C,0),0)","v":0},{"$f":"IFERROR(MATCH($A344&\"#\"&T$1,'[1]Pt1-DATA'!$C:$C,0),0)","v":0}]
[31,"Turbine GA","Turbine GA","Other light aircraft","Beechcraft Premier I","Williams FJ44-2A",null,null,false,null,{"$f":"IFERROR(MATCH($A345&\"#\"&K$1,'[1]Pt1-DATA'!$C:$C,0),0)","v":0},null,{"$f":"IFERROR(MATCH($A345&\"#\"&M$1,'[1]Pt1-DATA'!$C:$C,0),0)","v":0},{"$f":"IFERROR(MATCH($A345&\"#\"&N$1,'[1]Pt1-DATA'!$C:$C,0),0)","v":0},{"$f":"IFERROR(MATCH($A345&\"#\"&O$1,'[1]Pt1-DATA'!$C:$C,0),0)","v":0},{"$f":"IFERROR(MATCH($A345&\"#\"&P$1,'[1]Pt1-DATA'!$C:$C,0),0)","v":0},{"$f":"IFERROR(MATCH($A345&\"#\"&Q$1,'[1]Pt1-DATA'!$C:$C,0),0)","v":0},{"$f":"IFERROR(MATCH($A345&\"#\"&R$1,'[1]Pt1-DATA'!$C:$C,0),0)","v":0},{"$f":"IFERROR(MATCH($A345&\"#\"&S$1,'[1]Pt1-DATA'!$C:$C,0),0)","v":0},{"$f":"IFERROR(MATCH($A345&\"#\"&T$1,'[1]Pt1-DATA'!$C:$C,0),0)","v":0}]
[546,"Turbine GA","Turbine GA","PAC P-750 XSTOL","PAC P-750 XSTOL","Pratt & Whitney Canada PT6A",null,null,false,null,{"$f":"IFERROR(MATCH($A346&\"#\"&K$1,'[1]Pt1-DATA'!$C:$C,0),0)","v":0},null,{"$f":"IFERROR(MATCH($A346&\"#\"&M$1,'[1]Pt1-DATA'!$C:$C,0),0)","v":0},{"$f":"IFERROR(MATCH($A346&\"#\"&N$1,'[1]Pt1-DATA'!$C:$C,0),0)","v":0},{"$f":"IFERROR(MATCH($A346&\"#\"&O$1,'[1]Pt1-DATA'!$C:$C,0),0)","v":0},{"$f":"IFERROR(MATCH($A346&\"#\"&P$1,'[1]Pt1-DATA'!$C:$C,0),0)","v":0},{"$f":"IFERROR(MATCH($A346&\"#\"&Q$1,'[1]Pt1-DATA'!$C:$C,0),0)","v":0},{"$f":"IFERROR(MATCH($A346&\"#\"&R$1,'[1]Pt1-DATA'!$C:$C,0),0)","v":0},{"$f":"IFERROR(MATCH($A346&\"#\"&S$1,'[1]Pt1-DATA'!$C:$C,0),0)","v":0},{"$f":"IFERROR(MATCH($A346&\"#\"&T$1,'[1]Pt1-DATA'!$C:$C,0),0)","v":0}]
[75,"Turbine GA","Turbine GA","Piaggio P.180 Avanti","Piaggio P.180 Avanti","Pratt & Whitney Canada PT6A",null,null,false,null,{"$f":"IFERROR(MATCH($A347&\"#\"&K$1,'[1]Pt1-DATA'!$C:$C,0),0)","v":0},null,{"$f":"IFERROR(MATCH($A347&\"#\"&M$1,'[1]Pt1-DATA'!$C:$C,0),0)","v":0},{"$f":"IFERROR(MATCH($A347&\"#\"&N$1,'[1]Pt1-DATA'!$C:$C,0),0)","v":0},{"$f":"IFERROR(MATCH($A347&\"#\"&O$1,'[1]Pt1-DATA'!$C:$C,0),0)","v":0},{"$f":"IFERROR(MATCH($A347&\"#\"&P$1,'[1]Pt1-DATA'!$C:$C,0),0)","v":0},{"$f":"IFERROR(MATCH($A347&\"#\"&Q$1,'[1]Pt1-DATA'!$C:$C,0),0)","v":0},{"$f":"IFERROR(MATCH($A347&\"#\"&R$1,'[1]Pt1-DATA'!$C:$C,0),0)","v":0},{"$f":"IFERROR(MATCH($A347&\"#\"&S$1,'[1]Pt1-DATA'!$C:$C,0),0)","v":0},{"$f":"IFERROR(MATCH($A347&\"#\"&T$1,'[1]Pt1-DATA'!$C:$C,0),0)","v":0}]
[77,"Turbine GA","Turbine GA","Pilatus PC-12","Pilatus PC-12","Pratt & Whitney Canada PT6A",null,null,false,null,{"$f":"IFERROR(MATCH($A348&\"#\"&K$1,'[1]Pt1-DATA'!$C:$C,0),0)","v":0},null,{"$f":"IFERROR(MATCH($A348&\"#\"&M$1,'[1]Pt1-DATA'!$C:$C,0),0)","v":0},{"$f":"IFERROR(MATCH($A348&\"#\"&N$1,'[1]Pt1-DATA'!$C:$C,0),0)","v":0},{"$f":"IFERROR(MATCH($A348&\"#\"&O$1,'[1]Pt1-DATA'!$C:$C,0),0)","v":0},{"$f":"IFERROR(MATCH($A348&\"#\"&P$1,'[1]Pt1-DATA'!$C:$C,0),0)","v":0},{"$f":"IFERROR(MATCH($A348&\"#\"&Q$1,'[1]Pt1-DATA'!$C:$C,0),0)","v":0},{"$f":"IFERROR(MATCH($A348&\"#\"&R$1,'[1]Pt1-DATA'!$C:$C,0),0)","v":0},{"$f":"IFERROR(MATCH($A348&\"#\"&S$1,'[1]Pt1-DATA'!$C:$C,0),0)","v":0},{"$f":"IFERROR(MATCH($A348&\"#\"&T$1,'[1]Pt1-DATA'!$C:$C,0),0)","v":0}]
[76,"Turbine GA","Turbine GA","Piper PA-46","Piper PA-46","Pratt & Whitney Canada PT6A",null,null,false,null,{"$f":"IFERROR(MATCH($A349&\"#\"&K$1,'[1]Pt1-DATA'!$C:$C,0),0)","v":0},null,{"$f":"IFERROR(MATCH($A349&\"#\"&M$1,'[1]Pt1-DATA'!$C:$C,0),0)","v":0},{"$f":"IFERROR(MATCH($A349&\"#\"&N$1,'[1]Pt1-DATA'!$C:$C,0),0)","v":0},{"$f":"IFERROR(MATCH($A349&\"#\"&O$1,'[1]Pt1-DATA'!$C:$C,0),0)","v":0},{"$f":"IFERROR(MATCH($A349&\"#\"&P$1,'[1]Pt1-DATA'!$C:$C,0),0)","v":0},{"$f":"IFERROR(MATCH($A349&\"#\"&Q$1,'[1]Pt1-DATA'!$C:$C,0),0)","v":0},{"$f":"IFERROR(MATCH($A349&\"#\"&R$1,'[1]Pt1-DATA'!$C:$C,0),0)","v":0},{"$f":"IFERROR(MATCH($A349&\"#\"&S$1,'[1]Pt1-DATA'!$C:$C,0),0)","v":0},{"$f":"IFERROR(MATCH($A349&\"#\"&T$1,'[1]Pt1-DATA'!$C:$C,0),0)","v":0}]
[186,"Turbine GA","Turbine GA","PT6A powered light aircraft","many and various using the Pratt & Whitney Canada PT6A","Pratt & Whitney Canada PT6A",null,null,false,null,{"$f":"IFERROR(MATCH($A350&\"#\"&K$1,'[1]Pt1-DATA'!$C:$C,0),0)","v":0},null,{"$f":"IFERROR(MATCH($A350&\"#\"&M$1,'[1]Pt1-DATA'!$C:$C,0),0)","v":0},{"$f":"IFERROR(MATCH($A350&\"#\"&N$1,'[1]Pt1-DATA'!$C:$C,0),0)","v":0},{"$f":"IFERROR(MATCH($A350&\"#\"&O$1,'[1]Pt1-DATA'!$C:$C,0),0)","v":0},{"$f":"IFERROR(MATCH($A350&\"#\"&P$1,'[1]Pt1-DATA'!$C:$C,0),0)","v":0},{"$f":"IFERROR(MATCH($A350&\"#\"&Q$1,'[1]Pt1-DATA'!$C:$C,0),0)","v":0},{"$f":"IFERROR(MATCH($A350&\"#\"&R$1,'[1]Pt1-DATA'!$C:$C,0),0)","v":0},{"$f":"IFERROR(MATCH($A350&\"#\"&S$1,'[1]Pt1-DATA'!$C:$C,0),0)","v":0},{"$f":"IFERROR(MATCH($A350&\"#\"&T$1,'[1]Pt1-DATA'!$C:$C,0),0)","v":0}]
[547,"Turbine GA","Turbine GA","Quest Kodiak","Quest Kodiak","Pratt & Whitney Canada PT6A",null,null,false,null,{"$f":"IFERROR(MATCH($A351&\"#\"&K$1,'[1]Pt1-DATA'!$C:$C,0),0)","v":0},null,{"$f":"IFERROR(MATCH($A351&\"#\"&M$1,'[1]Pt1-DATA'!$C:$C,0),0)","v":0},{"$f":"IFERROR(MATCH($A351&\"#\"&N$1,'[1]Pt1-DATA'!$C:$C,0),0)","v":0},{"$f":"IFERROR(MATCH($A351&\"#\"&O$1,'[1]Pt1-DATA'!$C:$C,0),0)","v":0},{"$f":"IFERROR(MATCH($A351&\"#\"&P$1,'[1]Pt1-DATA'!$C:$C,0),0)","v":0},{"$f":"IFERROR(MATCH($A351&\"#\"&Q$1,'[1]Pt1-DATA'!$C:$C,0),0)","v":0},{"$f":"IFERROR(MATCH($A351&\"#\"&R$1,'[1]Pt1-DATA'!$C:$C,0),0)","v":0},{"$f":"IFERROR(MATCH($A351&\"#\"&S$1,'[1]Pt1-DATA'!$C:$C,0),0)","v":0},{"$f":"IFERROR(MATCH($A351&\"#\"&T$1,'[1]Pt1-DATA'!$C:$C,0),0)","v":0}]
[79,"Turbine GA","Turbine GA","Reims-Cessna F406 Caravan II","Reims-Cessna F406 Caravan II","Pratt & Whitney Canada PT6A",null,null,false,null,{"$f":"IFERROR(MATCH($A352&\"#\"&K$1,'[1]Pt1-DATA'!$C:$C,0),0)","v":0},null,{"$f":"IFERROR(MATCH($A352&\"#\"&M$1,'[1]Pt1-DATA'!$C:$C,0),0)","v":0},{"$f":"IFERROR(MATCH($A352&\"#\"&N$1,'[1]Pt1-DATA'!$C:$C,0),0)","v":0},{"$f":"IFERROR(MATCH($A352&\"#\"&O$1,'[1]Pt1-DATA'!$C:$C,0),0)","v":0},{"$f":"IFERROR(MATCH($A352&\"#\"&P$1,'[1]Pt1-DATA'!$C:$C,0),0)","v":0},{"$f":"IFERROR(MATCH($A352&\"#\"&Q$1,'[1]Pt1-DATA'!$C:$C,0),0)","v":0},{"$f":"IFERROR(MATCH($A352&\"#\"&R$1,'[1]Pt1-DATA'!$C:$C,0),0)","v":0},{"$f":"IFERROR(MATCH($A352&\"#\"&S$1,'[1]Pt1-DATA'!$C:$C,0),0)","v":0},{"$f":"IFERROR(MATCH($A352&\"#\"&T$1,'[1]Pt1-DATA'!$C:$C,0),0)","v":0}]
[78,"Turbine GA","Turbine GA","SOCATA TBM","SOCATA TBM","Pratt & Whitney Canada PT6A",null,null,false,null,{"$f":"IFERROR(MATCH($A353&\"#\"&K$1,'[1]Pt1-DATA'!$C:$C,0),0)","v":0},null,{"$f":"IFERROR(MATCH($A353&\"#\"&M$1,'[1]Pt1-DATA'!$C:$C,0),0)","v":0},{"$f":"IFERROR(MATCH($A353&\"#\"&N$1,'[1]Pt1-DATA'!$C:$C,0),0)","v":0},{"$f":"IFERROR(MATCH($A353&\"#\"&O$1,'[1]Pt1-DATA'!$C:$C,0),0)","v":0},{"$f":"IFERROR(MATCH($A353&\"#\"&P$1,'[1]Pt1-DATA'!$C:$C,0),0)","v":0},{"$f":"IFERROR(MATCH($A353&\"#\"&Q$1,'[1]Pt1-DATA'!$C:$C,0),0)","v":0},{"$f":"IFERROR(MATCH($A353&\"#\"&R$1,'[1]Pt1-DATA'!$C:$C,0),0)","v":0},{"$f":"IFERROR(MATCH($A353&\"#\"&S$1,'[1]Pt1-DATA'!$C:$C,0),0)","v":0},{"$f":"IFERROR(MATCH($A353&\"#\"&T$1,'[1]Pt1-DATA'!$C:$C,0),0)","v":0}]
[614,"Turbine GA","Turbine GA","Viking Twin Otter","Viking Twin Otter","Pratt & Whitney Canada PT6A",null,null,false,null,{"$f":"IFERROR(MATCH($A354&\"#\"&K$1,'[1]Pt1-DATA'!$C:$C,0),0)","v":0},null,{"$f":"IFERROR(MATCH($A354&\"#\"&M$1,'[1]Pt1-DATA'!$C:$C,0),0)","v":0},{"$f":"IFERROR(MATCH($A354&\"#\"&N$1,'[1]Pt1-DATA'!$C:$C,0),0)","v":0},{"$f":"IFERROR(MATCH($A354&\"#\"&O$1,'[1]Pt1-DATA'!$C:$C,0),0)","v":0},{"$f":"IFERROR(MATCH($A354&\"#\"&P$1,'[1]Pt1-DATA'!$C:$C,0),0)","v":0},{"$f":"IFERROR(MATCH($A354&\"#\"&Q$1,'[1]Pt1-DATA'!$C:$C,0),0)","v":0},{"$f":"IFERROR(MATCH($A354&\"#\"&R$1,'[1]Pt1-DATA'!$C:$C,0),0)","v":0},{"$f":"IFERROR(MATCH($A354&\"#\"&S$1,'[1]Pt1-DATA'!$C:$C,0),0)","v":0},{"$f":"IFERROR(MATCH($A354&\"#\"&T$1,'[1]Pt1-DATA'!$C:$C,0),0)","v":0}]
[175,"Turboprop Trainers / Light Attack","Fighters and Jet Trainers","KAI KT-1 Woongbi","KAI KT-1 Woongbi","Pratt & Whitney Canada PT6A","mil fighter",null,false,null,{"$f":"IFERROR(MATCH($A355&\"#\"&K$1,'[1]Pt1-DATA'!$C:$C,0),0)","v":0},null,{"$f":"IFERROR(MATCH($A355&\"#\"&M$1,'[1]Pt1-DATA'!$C:$C,0),0)","v":0},{"$f":"IFERROR(MATCH($A355&\"#\"&N$1,'[1]Pt1-DATA'!$C:$C,0),0)","v":0},{"$f":"IFERROR(MATCH($A355&\"#\"&O$1,'[1]Pt1-DATA'!$C:$C,0),0)","v":0},{"$f":"IFERROR(MATCH($A355&\"#\"&P$1,'[1]Pt1-DATA'!$C:$C,0),0)","v":0},{"$f":"IFERROR(MATCH($A355&\"#\"&Q$1,'[1]Pt1-DATA'!$C:$C,0),0)","v":0},{"$f":"IFERROR(MATCH($A355&\"#\"&R$1,'[1]Pt1-DATA'!$C:$C,0),0)","v":0},{"$f":"IFERROR(MATCH($A355&\"#\"&S$1,'[1]Pt1-DATA'!$C:$C,0),0)","v":0},{"$f":"IFERROR(MATCH($A355&\"#\"&T$1,'[1]Pt1-DATA'!$C:$C,0),0)","v":0}]
[306,"Turboprop Trainers / Light Attack","Fighters and Jet Trainers","TAI Hürkus","TAI Hürkus","Pratt & Whitney Canada PT6A","mil fighter",null,false,null,{"$f":"IFERROR(MATCH($A356&\"#\"&K$1,'[1]Pt1-DATA'!$C:$C,0),0)","v":0},null,{"$f":"IFERROR(MATCH($A356&\"#\"&M$1,'[1]Pt1-DATA'!$C:$C,0),0)","v":0},{"$f":"IFERROR(MATCH($A356&\"#\"&N$1,'[1]Pt1-DATA'!$C:$C,0),0)","v":0},{"$f":"IFERROR(MATCH($A356&\"#\"&O$1,'[1]Pt1-DATA'!$C:$C,0),0)","v":0},{"$f":"IFERROR(MATCH($A356&\"#\"&P$1,'[1]Pt1-DATA'!$C:$C,0),0)","v":0},{"$f":"IFERROR(MATCH($A356&\"#\"&Q$1,'[1]Pt1-DATA'!$C:$C,0),0)","v":0},{"$f":"IFERROR(MATCH($A356&\"#\"&R$1,'[1]Pt1-DATA'!$C:$C,0),0)","v":0},{"$f":"IFERROR(MATCH($A356&\"#\"&S$1,'[1]Pt1-DATA'!$C:$C,0),0)","v":0},{"$f":"IFERROR(MATCH($A356&\"#\"&T$1,'[1]Pt1-DATA'!$C:$C,0),0)","v":0}]
[169,"Turboprop Trainers / Light Attack","Turboprop Trainers / Light Attack","Beechcraft T-6 Texan II","Beechcraft T-6 Texan II","Pratt & Whitney Canada PT6A","mil trainer",null,false,null,{"$f":"IFERROR(MATCH($A357&\"#\"&K$1,'[1]Pt1-DATA'!$C:$C,0),0)","v":0},null,{"$f":"IFERROR(MATCH($A357&\"#\"&M$1,'[1]Pt1-DATA'!$C:$C,0),0)","v":0},{"$f":"IFERROR(MATCH($A357&\"#\"&N$1,'[1]Pt1-DATA'!$C:$C,0),0)","v":0},{"$f":"IFERROR(MATCH($A357&\"#\"&O$1,'[1]Pt1-DATA'!$C:$C,0),0)","v":0},{"$f":"IFERROR(MATCH($A357&\"#\"&P$1,'[1]Pt1-DATA'!$C:$C,0),0)","v":0},{"$f":"IFERROR(MATCH($A357&\"#\"&Q$1,'[1]Pt1-DATA'!$C:$C,0),0)","v":0},{"$f":"IFERROR(MATCH($A357&\"#\"&R$1,'[1]Pt1-DATA'!$C:$C,0),0)","v":0},{"$f":"IFERROR(MATCH($A357&\"#\"&S$1,'[1]Pt1-DATA'!$C:$C,0),0)","v":0},{"$f":"IFERROR(MATCH($A357&\"#\"&T$1,'[1]Pt1-DATA'!$C:$C,0),0)","v":0}]
[172,"Turboprop Trainers / Light Attack","Turboprop Trainers / Light Attack","Grob G 120TP","Grob G 120TP","Allison Model 250 (B)","mil fighter",null,false,null,{"$f":"IFERROR(MATCH($A358&\"#\"&K$1,'[1]Pt1-DATA'!$C:$C,0),0)","v":0},null,{"$f":"IFERROR(MATCH($A358&\"#\"&M$1,'[1]Pt1-DATA'!$C:$C,0),0)","v":0},{"$f":"IFERROR(MATCH($A358&\"#\"&N$1,'[1]Pt1-DATA'!$C:$C,0),0)","v":0},{"$f":"IFERROR(MATCH($A358&\"#\"&O$1,'[1]Pt1-DATA'!$C:$C,0),0)","v":0},{"$f":"IFERROR(MATCH($A358&\"#\"&P$1,'[1]Pt1-DATA'!$C:$C,0),0)","v":0},{"$f":"IFERROR(MATCH($A358&\"#\"&Q$1,'[1]Pt1-DATA'!$C:$C,0),0)","v":0},{"$f":"IFERROR(MATCH($A358&\"#\"&R$1,'[1]Pt1-DATA'!$C:$C,0),0)","v":0},{"$f":"IFERROR(MATCH($A358&\"#\"&S$1,'[1]Pt1-DATA'!$C:$C,0),0)","v":0},{"$f":"IFERROR(MATCH($A358&\"#\"&T$1,'[1]Pt1-DATA'!$C:$C,0),0)","v":0}]
[677,"Turboprop Trainers / Light Attack","Turboprop Trainers / Light Attack","HHT-40","HAL HHT-40","Honeywell TPE331","mil fighter",null,false,null,{"$f":"IFERROR(MATCH($A359&\"#\"&K$1,'[1]Pt1-DATA'!$C:$C,0),0)","v":0},null,{"$f":"IFERROR(MATCH($A359&\"#\"&M$1,'[1]Pt1-DATA'!$C:$C,0),0)","v":0},{"$f":"IFERROR(MATCH($A359&\"#\"&N$1,'[1]Pt1-DATA'!$C:$C,0),0)","v":0},{"$f":"IFERROR(MATCH($A359&\"#\"&O$1,'[1]Pt1-DATA'!$C:$C,0),0)","v":0},{"$f":"IFERROR(MATCH($A359&\"#\"&P$1,'[1]Pt1-DATA'!$C:$C,0),0)","v":0},{"$f":"IFERROR(MATCH($A359&\"#\"&Q$1,'[1]Pt1-DATA'!$C:$C,0),0)","v":0},{"$f":"IFERROR(MATCH($A359&\"#\"&R$1,'[1]Pt1-DATA'!$C:$C,0),0)","v":0},{"$f":"IFERROR(MATCH($A359&\"#\"&S$1,'[1]Pt1-DATA'!$C:$C,0),0)","v":0},{"$f":"IFERROR(MATCH($A359&\"#\"&T$1,'[1]Pt1-DATA'!$C:$C,0),0)","v":0}]
[227,"Turboprop Trainers / Light Attack","Turboprop Trainers / Light Attack","Other Turboprop trainers/light attack","Other Turboprop trainers/light attack","Unknown","mil fighter",null,false,null,{"$f":"IFERROR(MATCH($A360&\"#\"&K$1,'[1]Pt1-DATA'!$C:$C,0),0)","v":0},null,{"$f":"IFERROR(MATCH($A360&\"#\"&M$1,'[1]Pt1-DATA'!$C:$C,0),0)","v":0},{"$f":"IFERROR(MATCH($A360&\"#\"&N$1,'[1]Pt1-DATA'!$C:$C,0),0)","v":0},{"$f":"IFERROR(MATCH($A360&\"#\"&O$1,'[1]Pt1-DATA'!$C:$C,0),0)","v":0},{"$f":"IFERROR(MATCH($A360&\"#\"&P$1,'[1]Pt1-DATA'!$C:$C,0),0)","v":0},{"$f":"IFERROR(MATCH($A360&\"#\"&Q$1,'[1]Pt1-DATA'!$C:$C,0),0)","v":0},{"$f":"IFERROR(MATCH($A360&\"#\"&R$1,'[1]Pt1-DATA'!$C:$C,0),0)","v":0},{"$f":"IFERROR(MATCH($A360&\"#\"&S$1,'[1]Pt1-DATA'!$C:$C,0),0)","v":0},{"$f":"IFERROR(MATCH($A360&\"#\"&T$1,'[1]Pt1-DATA'!$C:$C,0),0)","v":0}]
[177,"Turboprop Trainers / Light Attack","Turboprop Trainers / Light Attack","PC-7","Pilatus PC-7 Mk II","Pratt & Whitney Canada PT6A","mil fighter",null,false,null,{"$f":"IFERROR(MATCH($A361&\"#\"&K$1,'[1]Pt1-DATA'!$C:$C,0),0)","v":0},null,{"$f":"IFERROR(MATCH($A361&\"#\"&M$1,'[1]Pt1-DATA'!$C:$C,0),0)","v":0},{"$f":"IFERROR(MATCH($A361&\"#\"&N$1,'[1]Pt1-DATA'!$C:$C,0),0)","v":0},{"$f":"IFERROR(MATCH($A361&\"#\"&O$1,'[1]Pt1-DATA'!$C:$C,0),0)","v":0},{"$f":"IFERROR(MATCH($A361&\"#\"&P$1,'[1]Pt1-DATA'!$C:$C,0),0)","v":0},{"$f":"IFERROR(MATCH($A361&\"#\"&Q$1,'[1]Pt1-DATA'!$C:$C,0),0)","v":0},{"$f":"IFERROR(MATCH($A361&\"#\"&R$1,'[1]Pt1-DATA'!$C:$C,0),0)","v":0},{"$f":"IFERROR(MATCH($A361&\"#\"&S$1,'[1]Pt1-DATA'!$C:$C,0),0)","v":0},{"$f":"IFERROR(MATCH($A361&\"#\"&T$1,'[1]Pt1-DATA'!$C:$C,0),0)","v":0}]
[178,"Turboprop Trainers / Light Attack","Turboprop Trainers / Light Attack","PC-9","Pilatus PC-9/PC-21","Pratt & Whitney Canada PT6A","mil fighter",null,false,null,{"$f":"IFERROR(MATCH($A362&\"#\"&K$1,'[1]Pt1-DATA'!$C:$C,0),0)","v":0},null,{"$f":"IFERROR(MATCH($A362&\"#\"&M$1,'[1]Pt1-DATA'!$C:$C,0),0)","v":0},{"$f":"IFERROR(MATCH($A362&\"#\"&N$1,'[1]Pt1-DATA'!$C:$C,0),0)","v":0},{"$f":"IFERROR(MATCH($A362&\"#\"&O$1,'[1]Pt1-DATA'!$C:$C,0),0)","v":0},{"$f":"IFERROR(MATCH($A362&\"#\"&P$1,'[1]Pt1-DATA'!$C:$C,0),0)","v":0},{"$f":"IFERROR(MATCH($A362&\"#\"&Q$1,'[1]Pt1-DATA'!$C:$C,0),0)","v":0},{"$f":"IFERROR(MATCH($A362&\"#\"&R$1,'[1]Pt1-DATA'!$C:$C,0),0)","v":0},{"$f":"IFERROR(MATCH($A362&\"#\"&S$1,'[1]Pt1-DATA'!$C:$C,0),0)","v":0},{"$f":"IFERROR(MATCH($A362&\"#\"&T$1,'[1]Pt1-DATA'!$C:$C,0),0)","v":0}]
[170,"Turboprop Trainers / Light Attack","Turboprop Trainers / Light Attack","Tucano","Embraer EMB 312/314 Tucano","Pratt & Whitney Canada PT6A","mil fighter",null,false,null,{"$f":"IFERROR(MATCH($A363&\"#\"&K$1,'[1]Pt1-DATA'!$C:$C,0),0)","v":0},null,{"$f":"IFERROR(MATCH($A363&\"#\"&M$1,'[1]Pt1-DATA'!$C:$C,0),0)","v":0},{"$f":"IFERROR(MATCH($A363&\"#\"&N$1,'[1]Pt1-DATA'!$C:$C,0),0)","v":0},{"$f":"IFERROR(MATCH($A363&\"#\"&O$1,'[1]Pt1-DATA'!$C:$C,0),0)","v":0},{"$f":"IFERROR(MATCH($A363&\"#\"&P$1,'[1]Pt1-DATA'!$C:$C,0),0)","v":0},{"$f":"IFERROR(MATCH($A363&\"#\"&Q$1,'[1]Pt1-DATA'!$C:$C,0),0)","v":0},{"$f":"IFERROR(MATCH($A363&\"#\"&R$1,'[1]Pt1-DATA'!$C:$C,0),0)","v":0},{"$f":"IFERROR(MATCH($A363&\"#\"&S$1,'[1]Pt1-DATA'!$C:$C,0),0)","v":0},{"$f":"IFERROR(MATCH($A363&\"#\"&T$1,'[1]Pt1-DATA'!$C:$C,0),0)","v":0}]
[905,"UAV","CUAV","Other CUAV","Other CUAV","NULL",null,null,false,null,{"$f":"IFERROR(MATCH($A364&\"#\"&K$1,'[1]Pt1-DATA'!$C:$C,0),0)","v":0},null,{"$f":"IFERROR(MATCH($A364&\"#\"&M$1,'[1]Pt1-DATA'!$C:$C,0),0)","v":0},{"$f":"IFERROR(MATCH($A364&\"#\"&N$1,'[1]Pt1-DATA'!$C:$C,0),0)","v":0},{"$f":"IFERROR(MATCH($A364&\"#\"&O$1,'[1]Pt1-DATA'!$C:$C,0),0)","v":0},{"$f":"IFERROR(MATCH($A364&\"#\"&P$1,'[1]Pt1-DATA'!$C:$C,0),0)","v":0},{"$f":"IFERROR(MATCH($A364&\"#\"&Q$1,'[1]Pt1-DATA'!$C:$C,0),0)","v":0},{"$f":"IFERROR(MATCH($A364&\"#\"&R$1,'[1]Pt1-DATA'!$C:$C,0),0)","v":0},{"$f":"IFERROR(MATCH($A364&\"#\"&S$1,'[1]Pt1-DATA'!$C:$C,0),0)","v":0},{"$f":"IFERROR(MATCH($A364&\"#\"&T$1,'[1]Pt1-DATA'!$C:$C,0),0)","v":0}]
[901,"UAV","MALE/HALE","Bayraktar TB-2","Bayraktar TB-2","NULL",null,null,false,null,{"$f":"IFERROR(MATCH($A365&\"#\"&K$1,'[1]Pt1-DATA'!$C:$C,0),0)","v":0},null,{"$f":"IFERROR(MATCH($A365&\"#\"&M$1,'[1]Pt1-DATA'!$C:$C,0),0)","v":0},{"$f":"IFERROR(MATCH($A365&\"#\"&N$1,'[1]Pt1-DATA'!$C:$C,0),0)","v":0},{"$f":"IFERROR(MATCH($A365&\"#\"&O$1,'[1]Pt1-DATA'!$C:$C,0),0)","v":0},{"$f":"IFERROR(MATCH($A365&\"#\"&P$1,'[1]Pt1-DATA'!$C:$C,0),0)","v":0},{"$f":"IFERROR(MATCH($A365&\"#\"&Q$1,'[1]Pt1-DATA'!$C:$C,0),0)","v":0},{"$f":"IFERROR(MATCH($A365&\"#\"&R$1,'[1]Pt1-DATA'!$C:$C,0),0)","v":0},{"$f":"IFERROR(MATCH($A365&\"#\"&S$1,'[1]Pt1-DATA'!$C:$C,0),0)","v":0},{"$f":"IFERROR(MATCH($A365&\"#\"&T$1,'[1]Pt1-DATA'!$C:$C,0),0)","v":0}]
[673,"UAV","MALE/HALE","Eurodrone","Eurodrone","General Electric Catalyst",null,null,false,null,{"$f":"IFERROR(MATCH($A366&\"#\"&K$1,'[1]Pt1-DATA'!$C:$C,0),0)","v":0},null,{"$f":"IFERROR(MATCH($A366&\"#\"&M$1,'[1]Pt1-DATA'!$C:$C,0),0)","v":0},{"$f":"IFERROR(MATCH($A366&\"#\"&N$1,'[1]Pt1-DATA'!$C:$C,0),0)","v":0},{"$f":"IFERROR(MATCH($A366&\"#\"&O$1,'[1]Pt1-DATA'!$C:$C,0),0)","v":0},{"$f":"IFERROR(MATCH($A366&\"#\"&P$1,'[1]Pt1-DATA'!$C:$C,0),0)","v":0},{"$f":"IFERROR(MATCH($A366&\"#\"&Q$1,'[1]Pt1-DATA'!$C:$C,0),0)","v":0},{"$f":"IFERROR(MATCH($A366&\"#\"&R$1,'[1]Pt1-DATA'!$C:$C,0),0)","v":0},{"$f":"IFERROR(MATCH($A366&\"#\"&S$1,'[1]Pt1-DATA'!$C:$C,0),0)","v":0},{"$f":"IFERROR(MATCH($A366&\"#\"&T$1,'[1]Pt1-DATA'!$C:$C,0),0)","v":0}]
[449,"UAV","MALE/HALE","MQ-4C Triton","MQ-4C Triton","Rolls-Royce F137-RR-100",null,null,false,null,{"$f":"IFERROR(MATCH($A367&\"#\"&K$1,'[1]Pt1-DATA'!$C:$C,0),0)","v":0},null,{"$f":"IFERROR(MATCH($A367&\"#\"&M$1,'[1]Pt1-DATA'!$C:$C,0),0)","v":0},{"$f":"IFERROR(MATCH($A367&\"#\"&N$1,'[1]Pt1-DATA'!$C:$C,0),0)","v":0},{"$f":"IFERROR(MATCH($A367&\"#\"&O$1,'[1]Pt1-DATA'!$C:$C,0),0)","v":0},{"$f":"IFERROR(MATCH($A367&\"#\"&P$1,'[1]Pt1-DATA'!$C:$C,0),0)","v":0},{"$f":"IFERROR(MATCH($A367&\"#\"&Q$1,'[1]Pt1-DATA'!$C:$C,0),0)","v":0},{"$f":"IFERROR(MATCH($A367&\"#\"&R$1,'[1]Pt1-DATA'!$C:$C,0),0)","v":0},{"$f":"IFERROR(MATCH($A367&\"#\"&S$1,'[1]Pt1-DATA'!$C:$C,0),0)","v":0},{"$f":"IFERROR(MATCH($A367&\"#\"&T$1,'[1]Pt1-DATA'!$C:$C,0),0)","v":0}]
[450,"UAV","MALE/HALE","MQ-9 Reaper","MQ-9 Reaper","Honeywell TPE331",null,null,false,null,{"$f":"IFERROR(MATCH($A368&\"#\"&K$1,'[1]Pt1-DATA'!$C:$C,0),0)","v":0},null,{"$f":"IFERROR(MATCH($A368&\"#\"&M$1,'[1]Pt1-DATA'!$C:$C,0),0)","v":0},{"$f":"IFERROR(MATCH($A368&\"#\"&N$1,'[1]Pt1-DATA'!$C:$C,0),0)","v":0},{"$f":"IFERROR(MATCH($A368&\"#\"&O$1,'[1]Pt1-DATA'!$C:$C,0),0)","v":0},{"$f":"IFERROR(MATCH($A368&\"#\"&P$1,'[1]Pt1-DATA'!$C:$C,0),0)","v":0},{"$f":"IFERROR(MATCH($A368&\"#\"&Q$1,'[1]Pt1-DATA'!$C:$C,0),0)","v":0},{"$f":"IFERROR(MATCH($A368&\"#\"&R$1,'[1]Pt1-DATA'!$C:$C,0),0)","v":0},{"$f":"IFERROR(MATCH($A368&\"#\"&S$1,'[1]Pt1-DATA'!$C:$C,0),0)","v":0},{"$f":"IFERROR(MATCH($A368&\"#\"&T$1,'[1]Pt1-DATA'!$C:$C,0),0)","v":0}]
[902,"UAV","MALE/HALE","Other MALE/HALE","Other MALE/HALE","NULL",null,null,false,null,{"$f":"IFERROR(MATCH($A369&\"#\"&K$1,'[1]Pt1-DATA'!$C:$C,0),0)","v":0},null,{"$f":"IFERROR(MATCH($A369&\"#\"&M$1,'[1]Pt1-DATA'!$C:$C,0),0)","v":0},{"$f":"IFERROR(MATCH($A369&\"#\"&N$1,'[1]Pt1-DATA'!$C:$C,0),0)","v":0},{"$f":"IFERROR(MATCH($A369&\"#\"&O$1,'[1]Pt1-DATA'!$C:$C,0),0)","v":0},{"$f":"IFERROR(MATCH($A369&\"#\"&P$1,'[1]Pt1-DATA'!$C:$C,0),0)","v":0},{"$f":"IFERROR(MATCH($A369&\"#\"&Q$1,'[1]Pt1-DATA'!$C:$C,0),0)","v":0},{"$f":"IFERROR(MATCH($A369&\"#\"&R$1,'[1]Pt1-DATA'!$C:$C,0),0)","v":0},{"$f":"IFERROR(MATCH($A369&\"#\"&S$1,'[1]Pt1-DATA'!$C:$C,0),0)","v":0},{"$f":"IFERROR(MATCH($A369&\"#\"&T$1,'[1]Pt1-DATA'!$C:$C,0),0)","v":0}]
[452,"UAV","MALE/HALE","RQ-4A Global Hawk","RQ-4A Global Hawk","Rolls-Royce F137-RR-100","large UAV",null,false,null,{"$f":"IFERROR(MATCH($A370&\"#\"&K$1,'[1]Pt1-DATA'!$C:$C,0),0)","v":0},null,{"$f":"IFERROR(MATCH($A370&\"#\"&M$1,'[1]Pt1-DATA'!$C:$C,0),0)","v":0},{"$f":"IFERROR(MATCH($A370&\"#\"&N$1,'[1]Pt1-DATA'!$C:$C,0),0)","v":0},{"$f":"IFERROR(MATCH($A370&\"#\"&O$1,'[1]Pt1-DATA'!$C:$C,0),0)","v":0},{"$f":"IFERROR(MATCH($A370&\"#\"&P$1,'[1]Pt1-DATA'!$C:$C,0),0)","v":0},{"$f":"IFERROR(MATCH($A370&\"#\"&Q$1,'[1]Pt1-DATA'!$C:$C,0),0)","v":0},{"$f":"IFERROR(MATCH($A370&\"#\"&R$1,'[1]Pt1-DATA'!$C:$C,0),0)","v":0},{"$f":"IFERROR(MATCH($A370&\"#\"&S$1,'[1]Pt1-DATA'!$C:$C,0),0)","v":0},{"$f":"IFERROR(MATCH($A370&\"#\"&T$1,'[1]Pt1-DATA'!$C:$C,0),0)","v":0}]
[907,"UAV","TUAV","Other TUAV","Other TUAV","NULL",null,null,false,null,{"$f":"IFERROR(MATCH($A371&\"#\"&K$1,'[1]Pt1-DATA'!$C:$C,0),0)","v":0},null,{"$f":"IFERROR(MATCH($A371&\"#\"&M$1,'[1]Pt1-DATA'!$C:$C,0),0)","v":0},{"$f":"IFERROR(MATCH($A371&\"#\"&N$1,'[1]Pt1-DATA'!$C:$C,0),0)","v":0},{"$f":"IFERROR(MATCH($A371&\"#\"&O$1,'[1]Pt1-DATA'!$C:$C,0),0)","v":0},{"$f":"IFERROR(MATCH($A371&\"#\"&P$1,'[1]Pt1-DATA'!$C:$C,0),0)","v":0},{"$f":"IFERROR(MATCH($A371&\"#\"&Q$1,'[1]Pt1-DATA'!$C:$C,0),0)","v":0},{"$f":"IFERROR(MATCH($A371&\"#\"&R$1,'[1]Pt1-DATA'!$C:$C,0),0)","v":0},{"$f":"IFERROR(MATCH($A371&\"#\"&S$1,'[1]Pt1-DATA'!$C:$C,0),0)","v":0},{"$f":"IFERROR(MATCH($A371&\"#\"&T$1,'[1]Pt1-DATA'!$C:$C,0),0)","v":0}]
[906,"UAV","TUAV","RQ-7 Shadow","RQ-7 Shadow","NULL",null,null,false,null,{"$f":"IFERROR(MATCH($A372&\"#\"&K$1,'[1]Pt1-DATA'!$C:$C,0),0)","v":0},null,{"$f":"IFERROR(MATCH($A372&\"#\"&M$1,'[1]Pt1-DATA'!$C:$C,0),0)","v":0},{"$f":"IFERROR(MATCH($A372&\"#\"&N$1,'[1]Pt1-DATA'!$C:$C,0),0)","v":0},{"$f":"IFERROR(MATCH($A372&\"#\"&O$1,'[1]Pt1-DATA'!$C:$C,0),0)","v":0},{"$f":"IFERROR(MATCH($A372&\"#\"&P$1,'[1]Pt1-DATA'!$C:$C,0),0)","v":0},{"$f":"IFERROR(MATCH($A372&\"#\"&Q$1,'[1]Pt1-DATA'!$C:$C,0),0)","v":0},{"$f":"IFERROR(MATCH($A372&\"#\"&R$1,'[1]Pt1-DATA'!$C:$C,0),0)","v":0},{"$f":"IFERROR(MATCH($A372&\"#\"&S$1,'[1]Pt1-DATA'!$C:$C,0),0)","v":0},{"$f":"IFERROR(MATCH($A372&\"#\"&T$1,'[1]Pt1-DATA'!$C:$C,0),0)","v":0}]
[903,"UAV","VTUAV","MQ-8","MQ-8","Allison Model 250 (B)",null,null,false,null,{"$f":"IFERROR(MATCH($A373&\"#\"&K$1,'[1]Pt1-DATA'!$C:$C,0),0)","v":0},null,{"$f":"IFERROR(MATCH($A373&\"#\"&M$1,'[1]Pt1-DATA'!$C:$C,0),0)","v":0},{"$f":"IFERROR(MATCH($A373&\"#\"&N$1,'[1]Pt1-DATA'!$C:$C,0),0)","v":0},{"$f":"IFERROR(MATCH($A373&\"#\"&O$1,'[1]Pt1-DATA'!$C:$C,0),0)","v":0},{"$f":"IFERROR(MATCH($A373&\"#\"&P$1,'[1]Pt1-DATA'!$C:$C,0),0)","v":0},{"$f":"IFERROR(MATCH($A373&\"#\"&Q$1,'[1]Pt1-DATA'!$C:$C,0),0)","v":0},{"$f":"IFERROR(MATCH($A373&\"#\"&R$1,'[1]Pt1-DATA'!$C:$C,0),0)","v":0},{"$f":"IFERROR(MATCH($A373&\"#\"&S$1,'[1]Pt1-DATA'!$C:$C,0),0)","v":0},{"$f":"IFERROR(MATCH($A373&\"#\"&T$1,'[1]Pt1-DATA'!$C:$C,0),0)","v":0}]
[904,"UAV","VTUAV","Other VTUAV","Other VTUAV","NULL",null,null,false,null,{"$f":"IFERROR(MATCH($A374&\"#\"&K$1,'[1]Pt1-DATA'!$C:$C,0),0)","v":0},null,{"$f":"IFERROR(MATCH($A374&\"#\"&M$1,'[1]Pt1-DATA'!$C:$C,0),0)","v":0},{"$f":"IFERROR(MATCH($A374&\"#\"&N$1,'[1]Pt1-DATA'!$C:$C,0),0)","v":0},{"$f":"IFERROR(MATCH($A374&\"#\"&O$1,'[1]Pt1-DATA'!$C:$C,0),0)","v":0},{"$f":"IFERROR(MATCH($A374&\"#\"&P$1,'[1]Pt1-DATA'!$C:$C,0),0)","v":0},{"$f":"IFERROR(MATCH($A374&\"#\"&Q$1,'[1]Pt1-DATA'!$C:$C,0),0)","v":0},{"$f":"IFERROR(MATCH($A374&\"#\"&R$1,'[1]Pt1-DATA'!$C:$C,0),0)","v":0},{"$f":"IFERROR(MATCH($A374&\"#\"&S$1,'[1]Pt1-DATA'!$C:$C,0),0)","v":0},{"$f":"IFERROR(MATCH($A374&\"#\"&T$1,'[1]Pt1-DATA'!$C:$C,0),0)","v":0}]

{"sheet":"Sheet5","index":4,"n_rows":11,"n_cols":3,"rows_kept":11,"cut":false,"hidden":false,"merged":[]}
["Narrow Body",633,{"$f":"VALUE(B1)","v":633}]
["mil fighter",146,{"$f":"VALUE(B2)","v":146}]
["wide body (non IMA)",518,518]
["wide body (IMA)",199,199]
["regional",23,23]
["mil trainer",167,167]
["bizjet",36,36]
["Mil trans",150,150]
["rotorcraft mil",98,98]
["rotocraft civil",102,102]
["large UAV",452,452]