{"text_format":"1","workbook":"xlsx","n_sheets":5,"sheets":["Sheet1","Sheet2","Sheet3","Sheet4","Sheet5"],"not_rendered":{"charts":0,"images":0,"macros":0,"external_links":1,"defined_names":2,"comments":0,"pivot_tables":0},"unopened":[],"bounds":{"document_bytes":16777216,"sheet_cells":100000,"rows_first":2000,"rows_last":500,"rows_between":2000,"halvings":0,"cell_chars":16384,"cell_head_chars":4096},"cells_cut":0,"cells_raw":0,"read":"whole","date_system":"1900"}

{"sheet":"Sheet1","index":0,"n_rows":18,"n_cols":9,"rows_kept":18,"cut":false,"hidden":false,"merged":[]}
[710,41750,"710&41750","J","J (133% I)","J (133% I) [$31,313]","MCDU","50000, 47000","Boeing 747, Wide body VIP, A330, A300, A340, Boeing 767, McDonnell Douglas MD-11, Airbus A300"]
[null,null,null,"J1",null,null,null,null,"A350, Boeing 777, Boeing 777X, Boeing 787"]
[713,11206,"713&11206","C",null,"","A/T Engine Control Unit","34000, 13500","Boeing 747, Wide body VIP, A330, A340"]
[null,null,null,"C1",null,null,null,null,"Boeing 777, A350, Boeing 787"]
[721,10638,"721&10638","E",null,"","Air Data Modules (ADM)","13500, 17000, 23000","ACJ, BBJ, Wide body VIP, A330, A350, Boeing 777X, A340, A320ceo, Boeing 737, Boeing 737NG, Boeing 757, A220, A320neo, Boeing 717, Boeing 737 Classic, Boeing 737MAX, Boeing New Single Aisle (NSA), Comac C919, Irkut MC-21, Airbus A300, Boeing 767, Boeing 777, Boeing 787, A380, Boeing 747, B-52 Stratofortress, Boeing P-8 Poseidon, Boeing C-40 Clipper "]
[721,26597,"721&26597","P","P (120%O)","P (120%O) [$22,341]","Air Data Modules (ADM)","34000, 29746.1635642517","Challenger 600 series, Challenger 850, Citation Hemisphere, Citation Longitude, Falcon 10X, Falcon 6X, Falcon 7X/8X, Falcon 900, G450, G500/G600, G550, G650, G700, Global 7000, Global Express - 5000/6000, Legacy 600/650, Legacy 700, Lineage 1000, A330 LMXT, A330 MRTT, Boeing KC-46 Pegasus, C-17, C-5, Embraer KC-390, Kawasaki C-2, Kawasaki P-1, A400M Atlas, Alenia C-27J, C-130J, CASA C-212 Aviocar, CASA/IPTN CN-235, E-2, EADS CASA C-295, ShinMaywa US-2, Boeing KC-135 Stratotanker, McDonnell Douglas KC-10"]
[722,10999,"722&10999","G",null,"","Air data probes (pitot/static)","12000, 9000","Challenger 600 series, Challenger 850, Citation Hemisphere, Citation Longitude, Falcon 10X, Falcon 6X, Falcon 7X/8X, Falcon 900, G450, G500/G600, G550, G650, G700, Global 7000, Global Express - 5000/6000, Legacy 600/650, Legacy 700, Lineage 1000, Wide body VIP, A330, A350, Boeing 747, Boeing 777X, A300, A340, Boeing 767, McDonnell Douglas MD-11, Airbus A300, Boeing 777"]
[722,13200,"722&13200","I",null,"","Air data probes (pitot/static)","14000, 14762.9190904283","Boeing 747, Wide body VIP, Boeing 777, A350, Boeing 777X, Boeing 787, A330 LMXT, A330 MRTT, Boeing KC-46 Pegasus, C-17, C-5, Embraer KC-390, Kawasaki C-2, Kawasaki P-1, A400M Atlas, Alenia C-27J, C-130J, CASA C-212 Aviocar, CASA/IPTN CN-235, E-2, EADS CASA C-295, ShinMaywa US-2, Boeing KC-135 Stratotanker, McDonnell Douglas KC-10"]
[723,44327,"723&44327","D",null,"","Multi Mode Receiver (MMR)","56000, 45000, 49575.4480698043","ACJ, BBJ, Boeing 747, Wide body VIP, A330, A350, Boeing 777, Boeing 777X, A300, A340, Boeing 767, McDonnell Douglas MD-11, A320ceo, Boeing 737, Boeing 737NG, Boeing 757, A220, A320neo, Boeing 717, Boeing 737 Classic, Boeing 737MAX, Boeing New Single Aisle (NSA), Comac C919, Irkut MC-21, Airbus A300, Boeing 787, A380, A330 LMXT, A330 MRTT, Boeing KC-46 Pegasus, C-17, C-5, Embraer KC-390, Kawasaki C-2, Kawasaki P-1, A400M Atlas, Alenia C-27J, C-130J, CASA C-212 Aviocar, CASA/IPTN CN-235, E-2, EADS CASA C-295, ShinMaywa US-2, Boeing KC-135 Stratotanker, McDonnell Douglas KC-10"]
[749,0,"749&0","A",null,"","TCAS computer","17000, 20131.2533051296, 21000"]
[752,19569,"752&19569","J",null,"","Cockpit Voice Recorder","25000, 22000","ACJ, BBJ, Boeing 747, Wide body VIP, Boeing 777, A320ceo, Boeing 737, Boeing 737NG, Boeing 757, A220, A320neo, Boeing 717, Boeing 737 Classic, Boeing 737MAX, Boeing New Single Aisle (NSA), Comac C919, A350, Boeing 777X, Boeing 787"]
[755,9205,"755&9205","C",null,"","FD Interface Unit","10000, 11000","ACJ, BBJ, Boeing 747, Wide body VIP, Boeing 777, A320ceo, Boeing 737, Boeing 737NG, Boeing 757, A220, A320neo, Boeing 717, Boeing 737 Classic, Boeing 737MAX, Boeing New Single Aisle (NSA), Comac C919, Irkut MC-21, A350, Boeing 777X, Boeing 787, B-52 Stratofortress, Boeing P-8 Poseidon, Boeing C-40 Clipper "]
[764,15958,"764&15958","F",null,"","Radar altimeters","17000, 17847.4744579588, 21000","Wide body VIP, A330, A350, Boeing 747, Boeing 777X, A300, A340, Boeing 767, McDonnell Douglas MD-11, Airbus A300, Boeing 777, A330 LMXT, A330 MRTT, Boeing KC-46 Pegasus, C-17, C-5, Embraer KC-390, Kawasaki C-2, Kawasaki P-1, A400M Atlas, Alenia C-27J, C-130J, CASA C-212 Aviocar, CASA/IPTN CN-235, E-2, EADS CASA C-295, ShinMaywa US-2, Boeing KC-135 Stratotanker, McDonnell Douglas KC-10, Bombardier CRJ, Comac ARJ21, Embraer E170/190, ERJ 135/140/145, Sukhoi Superjet, ATR 42/72, ATR 42/72X, AVIC MA700, De Havilland Canada DHC-8, Dornier Do 328-100, Embraer , Xian MA60, Canadair CL-415"]
[764,17731,"764&17731","H",null,"","Radar altimeters","19830.402908514, 23000","Challenger 600 series, Challenger 850, Citation Hemisphere, Citation Longitude, Falcon 10X, Falcon 6X, Falcon 7X/8X, Falcon 900, G450, G500/G600, G550, G650, G700, Global 7000, Global Express - 5000/6000, Legacy 600/650, Legacy 700, Lineage 1000, Aero L-39NG, AIDC T-5, FMA IA 63 Pampa, Hawk, HJT-36 Sitara, Hongdu K-8, M-345, M-346, T-45, Tejas"]
[795,111607,"795&111607","A",null,"","Mission computers","111607, 124821.599312533","Aero L-39NG, AIDC T-5, FMA IA 63 Pampa, Hawk, HJT-36 Sitara, Hongdu K-8, M-345, M-346, T-45, Tejas, AH-1, AH-64, AW 249, Future Attack Reconnaissance Aircraft, TAI/Leonardo T129, Tiger, V-22, WAH-64, Airbus UH-72 Lakota, CH-47, HAL Dhruv, HAL Light Utility Helicopter, HAL Medium Lift, KAI KUH-1 Surion, Kawasaki OH-1, Leonardo AW101, Leonardo AW159 Lynx, MH139, NH90, OH-58, SH-60, Sikorsky CH-53K King Stallion, TAI T625, UH-1, UH-60, X6, KAI KT-1 Woongbi, TAI Hürkus, Beechcraft T-6 Texan II, Grob G 120TP, HHT-40, Other Turboprop trainers/light attack, PC-7, PC-9, Tucano"]
{"$rows_left_out":4}
{"sheet":"Sheet2","index":1,"n_rows":140,"n_cols":3,"rows_kept":140,"cut":false,"hidden":false,"merged":[]}
[{"$f":"INDEX('[1]Pt1-AvionicsComponentCosts'!$A:$C,MATCH(C1,'[1]Pt1-AvionicsComponentCosts'!$D:$D,0),1)","v":594},{"$f":"INDEX('[1]Pt1-AvionicsComponentCosts'!$A:$C,MATCH(C1,'[1]Pt1-AvionicsComponentCosts'!$D:$D,0),2)","v":"Business Jet"},"Boeing 747"]
[{"$f":"INDEX('[1]Pt1-AvionicsComponentCosts'!$A:$C,MATCH(C2,'[1]Pt1-AvionicsComponentCosts'!$D:$D,0),1)","v":678},{"$f":"INDEX('[1]Pt1-AvionicsComponentCosts'!$A:$C,MATCH(C2,'[1]Pt1-AvionicsComponentCosts'!$D:$D,0),2)","v":"Business Jet"},"Wide body VIP"]
[{"$f":"INDEX('[1]Pt1-AvionicsComponentCosts'!$A:$C,MATCH(C3,'[1]Pt1-AvionicsComponentCosts'!$D:$D,0),1)","v":565},{"$f":"INDEX('[1]Pt1-AvionicsComponentCosts'!$A:$C,MATCH(C3,'[1]Pt1-AvionicsComponentCosts'!$D:$D,0),2)","v":"Freighter"},"A330"]
[{"$f":"INDEX('[1]Pt1-AvionicsComponentCosts'!$A:$C,MATCH(C4,'[1]Pt1-AvionicsComponentCosts'!$D:$D,0),1)","v":632},{"$f":"INDEX('[1]Pt1-AvionicsComponentCosts'!$A:$C,MATCH(C4,'[1]Pt1-AvionicsComponentCosts'!$D:$D,0),2)","v":"Freighter"},"A300"]
[{"$f":"INDEX('[1]Pt1-AvionicsComponentCosts'!$A:$C,MATCH(C5,'[1]Pt1-AvionicsComponentCosts'!$D:$D,0),1)","v":669},{"$f":"INDEX('[1]Pt1-AvionicsComponentCosts'!$A:$C,MATCH(C5,'[1]Pt1-AvionicsComponentCosts'!$D:$D,0),2)","v":"Freighter"},"A340"]
[{"$f":"INDEX('[1]Pt1-AvionicsComponentCosts'!$A:$C,MATCH(C6,'[1]Pt1-AvionicsComponentCosts'!$D:$D,0),1)","v":570},{"$f":"INDEX('[1]Pt1-AvionicsComponentCosts'!$A:$C,MATCH(C6,'[1]Pt1-AvionicsComponentCosts'!$D:$D,0),2)","v":"Freighter"},"Boeing 767"]
[{"$f":"INDEX('[1]Pt1-AvionicsComponentCosts'!$A:$C,MATCH(C7,'[1]Pt1-AvionicsComponentCosts'!$D:$D,0),1)","v":627},{"$f":"INDEX('[1]Pt1-AvionicsComponentCosts'!$A:$C,MATCH(C7,'[1]Pt1-AvionicsComponentCosts'!$D:$D,0),2)","v":"Freighter"},"McDonnell Douglas MD-11"]
[{"$f":"INDEX('[1]Pt1-AvionicsComponentCosts'!$A:$C,MATCH(C8,'[1]Pt1-AvionicsComponentCosts'!$D:$D,0),1)","v":305},{"$f":"INDEX('[1]Pt1-AvionicsComponentCosts'!$A:$C,MATCH(C8,'[1]Pt1-AvionicsComponentCosts'!$D:$D,0),2)","v":"Large Commercial Aircraft"},"Airbus A300"]
[{"$f":"INDEX('[1]Pt1-AvionicsComponentCosts'!$A:$C,MATCH(C9,'[1]Pt1-AvionicsComponentCosts'!$D:$D,0),1)","v":644},{"$f":"INDEX('[1]Pt1-AvionicsComponentCosts'!$A:$C,MATCH(C9,'[1]Pt1-AvionicsComponentCosts'!$D:$D,0),2)","v":"Freighter"},"A350"]
[{"$f":"INDEX('[1]Pt1-AvionicsComponentCosts'!$A:$C,MATCH(C10,'[1]Pt1-AvionicsComponentCosts'!$D:$D,0),1)","v":664},{"$f":"INDEX('[1]Pt1-AvionicsComponentCosts'!$A:$C,MATCH(C10,'[1]Pt1-AvionicsComponentCosts'!$D:$D,0),2)","v":"Freighter"},"Boeing 777"]
[{"$f":"INDEX('[1]Pt1-AvionicsComponentCosts'!$A:$C,MATCH(C11,'[1]Pt1-AvionicsComponentCosts'!$D:$D,0),1)","v":659},{"$f":"INDEX('[1]Pt1-AvionicsComponentCosts'!$A:$C,MATCH(C11,'[1]Pt1-AvionicsComponentCosts'!$D:$D,0),2)","v":"Freighter"},"Boeing 777X"]
[{"$f":"INDEX('[1]Pt1-AvionicsComponentCosts'!$A:$C,MATCH(C12,'[1]Pt1-AvionicsComponentCosts'!$D:$D,0),1)","v":200},{"$f":"INDEX('[1]Pt1-AvionicsComponentCosts'!$A:$C,MATCH(C12,'[1]Pt1-AvionicsComponentCosts'!$D:$D,0),2)","v":"Large Commercial Aircraft"},"Boeing 787"]
[{"$f":"INDEX('[1]Pt1-AvionicsComponentCosts'!$A:$C,MATCH(C13,'[1]Pt1-AvionicsComponentCosts'!$D:$D,0),1)","v":674},{"$f":"INDEX('[1]Pt1-AvionicsComponentCosts'!$A:$C,MATCH(C13,'[1]Pt1-AvionicsComponentCosts'!$D:$D,0),2)","v":"Business Jet"},"ACJ"]
[{"$f":"INDEX('[1]Pt1-AvionicsComponentCosts'!$A:$C,MATCH(C14,'[1]Pt1-AvionicsComponentCosts'!$D:$D,0),1)","v":529},{"$f":"INDEX('[1]Pt1-AvionicsComponentCosts'!$A:$C,MATCH(C14,'[1]Pt1-AvionicsComponentCosts'!$D:$D,0),2)","v":"Business Jet"},"BBJ"]
[{"$f":"INDEX('[1]Pt1-AvionicsComponentCosts'!$A:$C,MATCH(C15,'[1]Pt1-AvionicsComponentCosts'!$D:$D,0),1)","v":665},{"$f":"INDEX('[1]Pt1-AvionicsComponentCosts'!$A:$C,MATCH(C15,'[1]Pt1-AvionicsComponentCosts'!$D:$D,0),2)","v":"Freighter"},"A320ceo"]
{"$rows_left_out":126}
{"sheet":"Sheet3","index":2,"n_rows":1,"n_cols":21,"rows_kept":1,"cut":false,"hidden":false,"merged":[]}
[null,null,null,null,882,null,773,null,775,null,833,null,822,null,785,null,805,null,784,null,774]

{"sheet":"Sheet4","index":3,"n_rows":374,"n_cols":20,"rows_kept":374,"cut":false,"hidden":false,"merged":[]}
["aircraft_id","aircraft_level_1","aircraft_level_2","aircraft_level_3","aircraft_level_4","engine_level_4","category",null,"IMA Items",null,710,null,774,775,784,785,805,822,833,882]
[674,"Business Jet","Large Jet","ACJ","Airbus ACJ TwoTwenty","Pratt & Whitney PW1500G","Narrow Body",null,{"$f":"SUM(K2:T2)>0","v":true},null,{"$f":"IFERROR(MATCH($A2&\"#\"&K$1,'[1]Pt1-DATA'!$C:$C,0),0)","v":313},null,{"$f":"IFERROR(MATCH($A2&\"#\"&M$1,'[1]Pt1-DATA'!$C:$C,0),0)","v":0},{"$f":"IFERROR(MATCH($A2&\"#\"&N$1,'[1]Pt1-DATA'!$C:$C,0),0)","v":7395},{"$f":"IFERROR(MATCH($A2&\"#\"&O$1,'[1]Pt1-DATA'!$C:$C,0),0)","v":0},{"$f":"IFERROR(MATCH($A2&\"#\"&P$1,'[1]Pt1-DATA'!$C:$C,0),0)","v":0},{"$f":"IFERROR(MATCH($A2&\"#\"&Q$1,'[1]Pt1-DATA'!$C:$C,0),0)","v":0},{"$f":"IFERROR(MATCH($A2&\"#\"&R$1,'[1]Pt1-DATA'!$C:$C,0),0)","v":0},{"$f":"IFERROR(MATCH($A2&\"#\"&S$1,'[1]Pt1-DATA'!$C:$C,0),0)","v":0},{"$f":"IFERROR(MATCH($A2&\"#\"&T$1,'[1]Pt1-DATA'!$C:$C,0),0)","v":0}]
[296,"Business Jet","Large Jet","ACJ","Airbus ACJ320 Family","CFM International CFM56 - 5B","Narrow Body",null,{"$f":"SUM(K3:T3)>0","v":true},null,{"$f":"IFERROR(MATCH($A3&\"#\"&K$1,'[1]Pt1-DATA'!$C:$C,0),0)","v":314},null,{"$f":"IFERROR(MATCH($A3&\"#\"&M$1,'[1]Pt1-DATA'!$C:$C,0),0)","v":0},{"$f":"IFERROR(MATCH($A3&\"#\"&N$1,'[1]Pt1-DATA'!$C:$C,0),0)","v":0},{"$f":"IFERROR(MATCH($A3&\"#\"&O$1,'[1]Pt1-DATA'!$C:$C,0),0)","v":0},{"$f":"IFERROR(MATCH($A3&\"#\"&P$1,'[1]Pt1-DATA'!$C:$C,0),0)","v":0},{"$f":"IFERROR(MATCH($A3&\"#\"&Q$1,'[1]Pt1-DATA'!$C:$C,0),0)","v":0},{"$f":"IFERROR(MATCH($A3&\"#\"&R$1,'[1]Pt1-DATA'!$C:$C,0),0)","v":0},{"$f":"IFERROR(MATCH($A3&\"#\"&S$1,'[1]Pt1-DATA'!$C:$C,0),0)","v":0},{"$f":"IFERROR(MATCH($A3&\"#\"&T$1,'[1]Pt1-DATA'!$C:$C,0),0)","v":0}]
[526,"Business Jet","Large Jet","ACJ","Airbus ACJ320 Family","IAE V2500-A5","Narrow Body",null,true,null,{"$f":"IFERROR(MATCH($A4&\"#\"&K$1,'[1]Pt1-DATA'!$C:$C,0),0)","v":315},null,{"$f":"IFERROR(MATCH($A4&\"#\"&M$1,'[1]Pt1-DATA'!$C:$C,0),0)","v":0},{"$f":"IFERROR(MATCH($A4&\"#\"&N$1,'[1]Pt1-DATA'!$C:$C,0),0)","v":0},{"$f":"IFERROR(MATCH($A4&\"#\"&O$1,'[1]Pt1-DATA'!$C:$C,0),0)","v":0},{"$f":"IFERROR(MATCH($A4&\"#\"&P$1,'[1]Pt1-DATA'!$C:$C,0),0)","v":0},{"$f":"IFERROR(MATCH($A4&\"#\"&Q$1,'[1]Pt1-DATA'!$C:$C,0),0)","v":0},{"$f":"IFERROR(MATCH($A4&\"#\"&R$1,'[1]Pt1-DATA'!$C:$C,0),0)","v":0},{"$f":"IFERROR(MATCH($A4&\"#\"&S$1,'[1]Pt1-DATA'!$C:$C,0),0)","v":0},{"$f":"IFERROR(MATCH($A4&\"#\"&T$1,'[1]Pt1-DATA'!$C:$C,0),0)","v":0}]
[528,"Business Jet","Large Jet","ACJ","Airbus ACJ320neo Family","CFM International LEAP-1A","Narrow Body",null,true,null,{"$f":"IFERROR(MATCH($A5&\"#\"&K$1,'[1]Pt1-DATA'!$C:$C,0),0)","v":316},null,{"$f":"IFERROR(MATCH($A5&\"#\"&M$1,'[1]Pt1-DATA'!$C:$C,0),0)","v":0},{"$f":"IFERROR(MATCH($A5&\"#\"&N$1,'[1]Pt1-DATA'!$C:$C,0),0)","v":0},{"$f":"IFERROR(MATCH($A5&\"#\"&O$1,'[1]Pt1-DATA'!$C:$C,0),0)","v":0},{"$f":"IFERROR(MATCH($A5&\"#\"&P$1,'[1]Pt1-DATA'!$C:$C,0),0)","v":0},{"$f":"IFERROR(MATCH($A5&\"#\"&Q$1,'[1]Pt1-DATA'!$C:$C,0),0)","v":0},{"$f":"IFERROR(MATCH($A5&\"#\"&R$1,'[1]Pt1-DATA'!$C:$C,0),0)","v":0},{"$f":"IFERROR(MATCH($A5&\"#\"&S$1,'[1]Pt1-DATA'!$C:$C,0),0)","v":0},{"$f":"IFERROR(MATCH($A5&\"#\"&T$1,'[1]Pt1-DATA'!$C:$C,0),0)","v":0}]
[527,"Business Jet","Large Jet","ACJ","Airbus ACJ320neo Family","Pratt & Whitney PW1100G","Narrow Body",null,true,null,{"$f":"IFERROR(MATCH($A6&\"#\"&K$1,'[1]Pt1-DATA'!$C:$C,0),0)","v":317},null,{"$f":"IFERROR(MATCH($A6&\"#\"&M$1,'[1]Pt1-DATA'!$C:$C,0),0)","v":0},{"$f":"IFERROR(MATCH($A6&\"#\"&N$1,'[1]Pt1-DATA'!$C:$C,0),0)","v":0},{"$f":"IFERROR(MATCH($A6&\"#\"&O$1,'[1]Pt1-DATA'!$C:$C,0),0)","v":0},{"$f":"IFERROR(MATCH($A6&\"#\"&P$1,'[1]Pt1-DATA'!$C:$C,0),0)","v":0},{"$f":"IFERROR(MATCH($A6&\"#\"&Q$1,'[1]Pt1-DATA'!$C:$C,0),0)","v":0},{"$f":"IFERROR(MATCH($A6&\"#\"&R$1,'[1]Pt1-DATA'!$C:$C,0),0)","v":0},{"$f":"IFERROR(MATCH($A6&\"#\"&S$1,'[1]Pt1-DATA'!$C:$C,0),0)","v":0},{"$f":"IFERROR(MATCH($A6&\"#\"&T$1,'[1]Pt1-DATA'!$C:$C,0),0)","v":0}]
[529,"Business Jet","Large Jet","BBJ","Boeing BBJ MAX","CFM International LEAP-1B","Narrow Body",null,true,null,{"$f":"IFERROR(MATCH($A7&\"#\"&K$1,'[1]Pt1-DATA'!$C:$C,0),0)","v":318},null,{"$f":"IFERROR(MATCH($A7&\"#\"&M$1,'[1]Pt1-DATA'!$C:$C,0),0)","v":0},{"$f":"IFERROR(MATCH($A7&\"#\"&N$1,'[1]Pt1-DATA'!$C:$C,0),0)","v":0},{"$f":"IFERROR(MATCH($A7&\"#\"&O$1,'[1]Pt1-DATA'!$C:$C,0),0)","v":0},{"$f":"IFERROR(MATCH($A7&\"#\"&P$1,'[1]Pt1-DATA'!$C:$C,0),0)","v":0},{"$f":"IFERROR(MATCH($A7&\"#\"&Q$1,'[1]Pt1-DATA'!$C:$C,0),0)","v":0},{"$f":"IFERROR(MATCH($A7&\"#\"&R$1,'[1]Pt1-DATA'!$C:$C,0),0)","v":0},{"$f":"IFERROR(MATCH($A7&\"#\"&S$1,'[1]Pt1-DATA'!$C:$C,0),0)","v":0},{"$f":"IFERROR(MATCH($A7&\"#\"&T$1,'[1]Pt1-DATA'!$C:$C,0),0)","v":0}]
[297,"Business Jet","Large Jet","BBJ","Boeing BBJ/BBJ2/BBJ3","CFM International CFM56 - 7B","Narrow Body",null,true,null,{"$f":"IFERROR(MATCH($A8&\"#\"&K$1,'[1]Pt1-DATA'!$C:$C,0),0)","v":319},null,{"$f":"IFERROR(MATCH($A8&\"#\"&M$1,'[1]Pt1-DATA'!$C:$C,0),0)","v":0},{"$f":"IFERROR(MATCH($A8&\"#\"&N$1,'[1]Pt1-DATA'!$C:$C,0),0)","v":0},{"$f":"IFERROR(MATCH($A8&\"#\"&O$1,'[1]Pt1-DATA'!$C:$C,0),0)","v":0},{"$f":"IFERROR(MATCH($A8&\"#\"&P$1,'[1]Pt1-DATA'!$C:$C,0),0)","v":0},{"$f":"IFERROR(MATCH($A8&\"#\"&Q$1,'[1]Pt1-DATA'!$C:$C,0),0)","v":0},{"$f":"IFERROR(MATCH($A8&\"#\"&R$1,'[1]Pt1-DATA'!$C:$C,0),0)","v":0},{"$f":"IFERROR(MATCH($A8&\"#\"&S$1,'[1]Pt1-DATA'!$C:$C,0),0)","v":0},{"$f":"IFERROR(MATCH($A8&\"#\"&T$1,'[1]Pt1-DATA'!$C:$C,0),0)","v":0}]
[594,"Business Jet","Large Jet","Boeing 747","Boeing 747-8 VIP","General Electric GEnx-2B","wide body (non IMA)",null,true,null,{"$f":"IFERROR(MATCH($A9&\"#\"&K$1,'[1]Pt1-DATA'!$C:$C,0),0)","v":394},null,{"$f":"IFERROR(MATCH($A9&\"#\"&M$1,'[1]Pt1-DATA'!$C:$C,0),0)","v":0},{"$f":"IFERROR(MATCH($A9&\"#\"&N$1,'[1]Pt1-DATA'!$C:$C,0),0)","v":7404},{"$f":"IFERROR(MATCH($A9&\"#\"&O$1,'[1]Pt1-DATA'!$C:$C,0),0)","v":7621},{"$f":"IFERROR(MATCH($A9&\"#\"&P$1,'[1]Pt1-DATA'!$C:$C,0),0)","v":0},{"$f":"IFERROR(MATCH($A9&\"#\"&Q$1,'[1]Pt1-DATA'!$C:$C,0),0)","v":0},{"$f":"IFERROR(MATCH($A9&\"#\"&R$1,'[1]Pt1-DATA'!$C:$C,0),0)","v":0},{"$f":"IFERROR(MATCH($A9&\"#\"&S$1,'[1]Pt1-DATA'!$C:$C,0),0)","v":0},{"$f":"IFERROR(MATCH($A9&\"#\"&T$1,'[1]Pt1-DATA'!$C:$C,0),0)","v":11614}]
[35,"Business Jet","Large Jet","Challenger 600 series","Bombardier Challenger 600 series","General Electric CF34-3B","bizjet",null,true,null,{"$f":"IFERROR(MATCH($A10&\"#\"&K$1,'[1]Pt1-DATA'!$C:$C,0),0)","v":290},null,{"$f":"IFERROR(MATCH($A10&\"#\"&M$1,'[1]Pt1-DATA'!$C:$C,0),0)","v":0},{"$f":"IFERROR(MATCH($A10&\"#\"&N$1,'[1]Pt1-DATA'!$C:$C,0),0)","v":0},{"$f":"IFERROR(MATCH($A10&\"#\"&O$1,'[1]Pt1-DATA'!$C:$C,0),0)","v":0},{"$f":"IFERROR(MATCH($A10&\"#\"&P$1,'[1]Pt1-DATA'!$C:$C,0),0)","v":0},{"$f":"IFERROR(MATCH($A10&\"#\"&Q$1,'[1]Pt1-DATA'!$C:$C,0),0)","v":0},{"$f":"IFERROR(MATCH($A10&\"#\"&R$1,'[1]Pt1-DATA'!$C:$C,0),0)","v":8726},{"$f":"IFERROR(MATCH($A10&\"#\"&S$1,'[1]Pt1-DATA'!$C:$C,0),0)","v":0},{"$f":"IFERROR(MATCH($A10&\"#\"&T$1,'[1]Pt1-DATA'!$C:$C,0),0)","v":0}]
[635,"Business Jet","Large Jet","Challenger 600 series","Bombardier Challenger 6XX series","General Electric CF34-3 (New)","bizjet",null,true,null,{"$f":"IFERROR(MATCH($A11&\"#\"&K$1,'[1]Pt1-DATA'!$C:$C,0),0)","v":291},null,{"$f":"IFERROR(MATCH($A11&\"#\"&M$1,'[1]Pt1-DATA'!$C:$C,0),0)","v":0},{"$f":"IFERROR(MATCH($A11&\"#\"&N$1,'[1]Pt1-DATA'!$C:$C,0),0)","v":0},{"$f":"IFERROR(MATCH($A11&\"#\"&O$1,'[1]Pt1-DATA'!$C:$C,0),0)","v":0},{"$f":"IFERROR(MATCH($A11&\"#\"&P$1,'[1]Pt1-DATA'!$C:$C,0),0)","v":0},{"$f":"IFERROR(MATCH($A11&\"#\"&Q$1,'[1]Pt1-DATA'!$C:$C,0),0)","v":0},{"$f":"IFERROR(MATCH($A11&\"#\"&R$1,'[1]Pt1-DATA'!$C:$C,0),0)","v":8727},{"$f":"IFERROR(MATCH($A11&\"#\"&S$1,'[1]Pt1-DATA'!$C:$C,0),0)","v":0},{"$f":"IFERROR(MATCH($A11&\"#\"&T$1,'[1]Pt1-DATA'!$C:$C,0),0)","v":0}]
[72,"Business Jet","Large Jet","Challenger 850","Bombardier Challenger 850","General Electric CF34-3B","bizjet",null,true,null,{"$f":"IFERROR(MATCH($A12&\"#\"&K$1,'[1]Pt1-DATA'!$C:$C,0),0)","v":292},null,{"$f":"IFERROR(MATCH($A12&\"#\"&M$1,'[1]Pt1-DATA'!$C:$C,0),0)","v":0},{"$f":"IFERROR(MATCH($A12&\"#\"&N$1,'[1]Pt1-DATA'!$C:$C,0),0)","v":0},{"$f":"IFERROR(MATCH($A12&\"#\"&O$1,'[1]Pt1-DATA'!$C:$C,0),0)","v":0},{"$f":"IFERROR(MATCH($A12&\"#\"&P$1,'[1]Pt1-DATA'!$C:$C,0),0)","v":0},{"$f":"IFERROR(MATCH($A12&\"#\"&Q$1,'[1]Pt1-DATA'!$C:$C,0),0)","v":0},{"$f":"IFERROR(MATCH($A12&\"#\"&R$1,'[1]Pt1-DATA'!$C:$C,0),0)","v":8728},{"$f":"IFERROR(MATCH($A12&\"#\"&S$1,'[1]Pt1-DATA'!$C:$C,0),0)","v":0},{"$f":"IFERROR(MATCH($A12&\"#\"&T$1,'[1]Pt1-DATA'!$C:$C,0),0)","v":0}]
[48,"Business Jet","Large Jet","Citation Hemisphere","Cessna Citation Hemisphere","Pratt & Whitney Canada PW800","bizjet",null,true,null,{"$f":"IFERROR(MATCH($A13&\"#\"&K$1,'[1]Pt1-DATA'!$C:$C,0),0)","v":293},null,{"$f":"IFERROR(MATCH($A13&\"#\"&M$1,'[1]Pt1-DATA'!$C:$C,0),0)","v":0},{"$f":"IFERROR(MATCH($A13&\"#\"&N$1,'[1]Pt1-DATA'!$C:$C,0),0)","v":0},{"$f":"IFERROR(MATCH($A13&\"#\"&O$1,'[1]Pt1-DATA'!$C:$C,0),0)","v":0},{"$f":"IFERROR(MATCH($A13&\"#\"&P$1,'[1]Pt1-DATA'!$C:$C,0),0)","v":0},{"$f":"IFERROR(MATCH($A13&\"#\"&Q$1,'[1]Pt1-DATA'!$C:$C,0),0)","v":0},{"$f":"IFERROR(MATCH($A13&\"#\"&R$1,'[1]Pt1-DATA'!$C:$C,0),0)","v":8729},{"$f":"IFERROR(MATCH($A13&\"#\"&S$1,'[1]Pt1-DATA'!$C:$C,0),0)","v":0},{"$f":"IFERROR(MATCH($A13&\"#\"&T$1,'[1]Pt1-DATA'!$C:$C,0),0)","v":0}]
[47,"Business Jet","Large Jet","Citation Longitude","Cessna Citation Longitude","Honeywell HTF7000 ","bizjet",null,true,null,{"$f":"IFERROR(MATCH($A14&\"#\"&K$1,'[1]Pt1-DATA'!$C:$C,0),0)","v":294},null,{"$f":"IFERROR(MATCH($A14&\"#\"&M$1,'[1]Pt1-DATA'!$C:$C,0),0)","v":0},{"$f":"IFERROR(MATCH($A14&\"#\"&N$1,'[1]Pt1-DATA'!$C:$C,0),0)","v":0},{"$f":"IFERROR(MATCH($A14&\"#\"&O$1,'[1]Pt1-DATA'!$C:$C,0),0)","v":0},{"$f":"IFERROR(MATCH($A14&\"#\"&P$1,'[1]Pt1-DATA'!$C:$C,0),0)","v":0},{"$f":"IFERROR(MATCH($A14&\"#\"&Q$1,'[1]Pt1-DATA'!$C:$C,0),0)","v":0},{"$f":"IFERROR(MATCH($A14&\"#\"&R$1,'[1]Pt1-DATA'!$C:$C,0),0)","v":8730},{"$f":"IFERROR(MATCH($A14&\"#\"&S$1,'[1]Pt1-DATA'!$C:$C,0),0)","v":0},{"$f":"IFERROR(MATCH($A14&\"#\"&T$1,'[1]Pt1-DATA'!$C:$C,0),0)","v":0}]
[587,"Business Jet","Large Jet","Falcon 10X","Dassault Falcon 10X","Rolls-Royce Pearl 10X","bizjet","IMA",true,null,{"$f":"IFERROR(MATCH($A15&\"#\"&K$1,'[1]Pt1-DATA'!$C:$C,0),0)","v":295},null,{"$f":"IFERROR(MATCH($A15&\"#\"&M$1,'[1]Pt1-DATA'!$C:$C,0),0)","v":0},{"$f":"IFERROR(MATCH($A15&\"#\"&N$1,'[1]Pt1-DATA'!$C:$C,0),0)","v":7381},{"$f":"IFERROR(MATCH($A15&\"#\"&O$1,'[1]Pt1-DATA'!$C:$C,0),0)","v":0},{"$f":"IFERROR(MATCH($A15&\"#\"&P$1,'[1]Pt1-DATA'!$C:$C,0),0)","v":0},{"$f":"IFERROR(MATCH($A15&\"#\"&Q$1,'[1]Pt1-DATA'!$C:$C,0),0)","v":0},{"$f":"IFERROR(MATCH($A15&\"#\"&R$1,'[1]Pt1-DATA'!$C:$C,0),0)","v":8731},{"$f":"IFERROR(MATCH($A15&\"#\"&S$1,'[1]Pt1-DATA'!$C:$C,0),0)","v":0},{"$f":"IFERROR(MATCH($A15&\"#\"&T$1,'[1]Pt1-DATA'!$C:$C,0),0)","v":0}]
{"$rows_left_out":360}
{"sheet":"Sheet5","index":4,"n_rows":11,"n_cols":3,"rows_kept":11,"cut":false,"hidden":false,"merged":[]}
["Narrow Body",633,{"$f":"VALUE(B1)","v":633}]
["mil fighter",146,{"$f":"VALUE(B2)","v":146}]
["wide body (non IMA)",518,518]
["wide body (IMA)",199,199]
["regional",23,23]
["mil trainer",167,167]
["bizjet",36,36]
["Mil trans",150,150]
["rotorcraft mil",98,98]
["rotocraft civil",102,102]
["large UAV",452,452]