{"text_format":"1","workbook":"xlsx","n_sheets":6,"sheets":["Compare JETNET-FAA (2)","Sheet1","Sheet3","Sheet2","Compare JETNET-FAA","JETNET Data"],"not_rendered":{"charts":0,"images":1,"macros":1,"external_links":1,"defined_names":12,"comments":0,"pivot_tables":0},"unopened":[],"bounds":{"document_bytes":16777216,"sheet_cells":100000,"rows_first":2000,"rows_last":500,"rows_between":2000,"halvings":0,"cell_chars":16384,"cell_head_chars":4096},"cells_cut":0,"cells_raw":0,"read":"whole","date_system":"1900"}

{"sheet":"Compare JETNET-FAA (2)","index":0,"n_rows":160,"n_cols":12,"rows_kept":160,"cut":false,"hidden":false,"merged":[[0,0,0,6],[0,7,0,11]]}
["JETNET Data",null,null,null,null,null,null,"FAA Registaration Data (4/7/2022)"]
["REGNBR","RELATIONTOAC","COMPANYNAME","COMPADDRESS1","COMPADDRESS2","COMPCITY","COMPSTATE",null,"NAME","STREET","CITY","STATE"]
["N150GV","Owner","Gulfstream Leasing, LLC","500 Gulfstream Road, Mail B-06",null,"Savannah","GA","N150GV","GULFSTREAM LEASING LLC","500 GULFSTREAM RD","SAVANNAH","GA"]
["N703HA","Owner","Full Send Aviation, LLC","190 Raleigh Street",null,"Wilmington","NC","N703HA","FULL SEND AVIATION LLC","109 RALEIGH ST","WILMINGTON","NC"]
["N530LD","Owner","4 Love of Flight, LLC","16150 Fitzhugh Road",null,"Dripping Springs","TX","N530LD","4 LOVE OF FLIGHT LLC","16150 FITZHUGH RD","DRIPPING SPRINGS","TX"]
["N7476C","Owner","Dodson International Parts, Inc.","2155 Vermont Road",null,"Rantoul","KS","N7476C",{"$error":"#N/A"},{"$error":"#N/A"},{"$error":"#N/A"},{"$error":"#N/A"}]
["N29JW","Operator","Schussboomer Systems, Inc.","P.O. Box 1420","317 Commercial Avenue","Anacortes","WA","N29JW","SCHUSSBOOMER SYSTEMS INC","PO BOX 1420","ANACORTES","WA"]
["N29JW","Owner","Schussboomer Systems, Inc.","P.O. Box 1420","317 Commercial Avenue","Anacortes","WA","N29JW","SCHUSSBOOMER SYSTEMS INC","PO BOX 1420","ANACORTES","WA"]
["N150QA","Operator","North Houston Pole Line","1608 Margaret Street",null,"Houston","TX","N150QA","TVPX AIRCRAFT SOLUTIONS INC TRUSTEE","39 E EAGLE RIDGE DR STE 201","NORTH SALT LAKE","UT"]
["N150QA","Owner","North Houston Pole Line","1608 Margaret Street",null,"Houston","TX","N150QA","TVPX AIRCRAFT SOLUTIONS INC TRUSTEE","39 E EAGLE RIDGE DR STE 201","NORTH SALT LAKE","UT"]
["N531GP","Owner","Blue Flag Two, Ltd.","P.O. Box 3806","110 N Main Street","Dayton","OH","N531GP","BLUE FLAG TWO LTD","PO BOX 3806","DAYTON","OH"]
["N150CT","Lessee","Promerica Financial Corporation","Calle 50 y 53 Este, Area Bancaria",null,"Panama City",null,"N150CT","BANK OF UTAH TRUSTEE","50 S 200 E STE 110","SALT LAKE CITY","UT"]
["N150CT","Owner","Leon Air, LLC","3191 Coral Way. Suite 800",null,"Miami","FL","N150CT","BANK OF UTAH TRUSTEE","50 S 200 E STE 110","SALT LAKE CITY","UT"]
["N209AW","Aircraft Management Company","Pinnacle Aviation, Inc.","14988 North 78th Way, Suite 106","Scottsdale Airport","Scottsdale","AZ","N209AW","BLUE STAR MANAGEMENT LLC","PO BOX 686","CRAIG","AK"]
["N209AW","Owner","Blue Star Management, LLC","P.O. Box 686","11.5 Mile Port St. Nicholas Road","Craig","AK","N209AW","BLUE STAR MANAGEMENT LLC","PO BOX 686","CRAIG","AK"]
{"$rows_left_out":146}
{"sheet":"Sheet1","index":1,"n_rows":1485,"n_cols":7,"rows_kept":1485,"cut":false,"hidden":false,"merged":[]}
[]
[]
[]
[]
[]
[]
[]
[]
[]
[]
[]
["N100PB (1978 PIPER AEROSTAR 601P)"]
["N100WE (RAYTHEON AIRCRAFT COMPANY 390)"]
["N101DG (1986 BELL 206B)"]
["N101RE (2017 BOMBARDIER INC CL-600-2B16(CL-604))"]
{"$rows_left_out":1471}
{"sheet":"Sheet3","index":2,"n_rows":125,"n_cols":15,"rows_kept":125,"cut":false,"hidden":false,"merged":[]}
[null,"REGNBR",null,null,null,null,null,null,null,null,"NAME","STREET","CITY","STATE","ZIP CODE"]
[null,"9H-LAR",null,null,null,null,null,null,{"$f":"\"N\"&J2","v":"N100GX"},"100GX","BRULECREEK AVIATION LLC","7 EAGLE VIEW CT","PARK CITY","UT",840606864]
[null,"CC-AOA",null,null,null,null,null,null,{"$f":"\"N\"&J3","v":"N100SR"},"100SR","RAYMAN STEVEN M TRUSTEE","47W210 RT 30","BIG ROCK","IL",60511]
[null,"CC-CWK",null,null,null,null,null,null,"N101RX","101RX","TEALL CAPITAL PARTNERS LLC","PO BOX 21528","WINSTON SALEM","NC",271201528]
[null,"C-FKAI",null,null,null,null,null,null,"N10RZ","10RZ","PEREGRINE FALCON LLC TRUSTEE","6225 N MEEKER PL STE 100","BOISE","ID",837131579]
[null,"C-FMDN",null,null,null,null,null,null,"N116NC","116NC","BENSON LEGACY LLC","7120 POINTE INVERNESS WAY","FORT WAYNE","IN",468047928]
[null,"C-FREE",null,null,null,null,null,null,"N123QU","123QU","DORADO AVIATION LLC","100 CAR 165 STE 508 CENTRO INTL","GUAYNABO","PR",9688052]
[null,"C-FTXX",null,null,null,null,null,null,"N12WF","12WF","PNC EQUIPMENT FINANCE LLC","4355 W EMERALD ST STE 100","BOISE","ID",837062053]
[null,"C-FWXR",null,null,null,null,null,null,"N13WF","13WF","TRUIST EQUIPMENT FINANCE CORP","245 PEACHTREE CENTER AVE NE","ATLANTA","GA",303031231]
[null,"C-GGGT",null,null,null,null,null,null,"N150CT","150CT","BANK OF UTAH TRUSTEE","50 S 200 E STE 110","SALT LAKE CITY","UT",841111617]
[null,"C-GPRN",null,null,null,null,null,null,"N150GA","150GA","GULFSTREAM LEASING LLC","M/S B-16","SAVANNAH","GA",31407]
[null,"C-GWQM",null,null,null,null,null,null,"N150GV","150GV","GULFSTREAM LEASING LLC","500 GULFSTREAM RD","SAVANNAH","GA",314089643]
[null,"C-GXNW",null,null,null,null,null,null,"N150JN","150JN","KOSELIG LLC","27821 36TH AVE NW","STANWOOD","WA",982929461]
[null,"C-GZCZ",null,null,null,null,null,null,"N150MT","150MT","GH CONSULTING SERVICES LLC","14747 N NORTHSIGHT BLVD","SCOTTSDALE","AZ",85260]
[null,"M-FAST",null,null,null,null,null,null,"N150QA","150QA","TVPX AIRCRAFT SOLUTIONS INC TRUSTEE","39 E EAGLE RIDGE DR STE 201","NORTH SALT LAKE","UT",840542533]
{"$rows_left_out":111}
{"sheet":"Sheet2","index":3,"n_rows":37,"n_cols":4,"rows_kept":37,"cut":false,"hidden":false,"merged":[]}
[]
["N100GX (2007)",{"$f":"geturl(A2)","v":"https://aircraft-data.com/N100GX"},{"$f":"IFERROR(TRIM(LEFT(A2,SEARCH(\" \",A2))),TRIM(A2))","v":"N100GX"},{"$f":"MATCH(C2,'[1]JETNET Data'!$D:$D,0)","v":47}]
["N100SR (2007)",{"$f":"geturl(A3)","v":"https://aircraft-data.com/N100SR"},{"$f":"IFERROR(TRIM(LEFT(A3,SEARCH(\" \",A3))),TRIM(A3))","v":"N100SR"},{"$f":"MATCH(C3,'[1]JETNET Data'!$D:$D,0)","v":45}]
["N120RC (2007)",{"$f":"geturl(A4)","v":"https://aircraft-data.com/N120RC"},"N120RC",{"$f":"MATCH(C4,'[1]JETNET Data'!$D:$D,0)","v":{"$error":"#N/A"}}]
["N150CT (2006)",{"$f":"geturl(A5)","v":"https://aircraft-data.com/N150CT"},"N150CT",{"$f":"MATCH(C5,'[1]JETNET Data'!$D:$D,0)","v":11}]
["N150GV (2007)",{"$f":"geturl(A6)","v":"https://aircraft-data.com/N150GV"},"N150GV",{"$f":"MATCH(C6,'[1]JETNET Data'!$D:$D,0)","v":2}]
["N150KM (2006)",{"$f":"geturl(A7)","v":"https://aircraft-data.com/N150KM"},"N150KM",{"$f":"MATCH(C7,'[1]JETNET Data'!$D:$D,0)","v":{"$error":"#N/A"}}]
["N150MT (2007)",{"$f":"geturl(A8)","v":"https://aircraft-data.com/N150MT"},"N150MT",{"$f":"MATCH(C8,'[1]JETNET Data'!$D:$D,0)","v":31}]
["N192SW (2006)",{"$f":"geturl(A9)","v":"https://aircraft-data.com/N192SW"},"N192SW",{"$f":"MATCH(C9,'[1]JETNET Data'!$D:$D,0)","v":25}]
["N1HE (2007)",{"$f":"geturl(A10)","v":"https://aircraft-data.com/N1HE"},"N1HE",{"$f":"MATCH(C10,'[1]JETNET Data'!$D:$D,0)","v":28}]
["N217MS (2007)",{"$f":"geturl(A11)","v":"https://aircraft-data.com/N217MS"},"N217MS",{"$f":"MATCH(C11,'[1]JETNET Data'!$D:$D,0)","v":27}]
["N222LR (2007)",{"$f":"geturl(A12)","v":"https://aircraft-data.com/N222LR"},"N222LR",{"$f":"MATCH(C12,'[1]JETNET Data'!$D:$D,0)","v":{"$error":"#N/A"}}]
["N224GG",{"$f":"geturl(A13)","v":"https://aircraft-data.com/N224GG"},"N224GG",{"$f":"MATCH(C13,'[1]JETNET Data'!$D:$D,0)","v":40}]
["N247PS (2006)",{"$f":"geturl(A14)","v":"https://aircraft-data.com/N247PS"},"N247PS",{"$f":"MATCH(C14,'[1]JETNET Data'!$D:$D,0)","v":23}]
["N248SL (2006)",{"$f":"geturl(A15)","v":"https://aircraft-data.com/N248SL"},"N248SL",{"$f":"MATCH(C15,'[1]JETNET Data'!$D:$D,0)","v":16}]
{"$rows_left_out":23}
{"sheet":"Compare JETNET-FAA","index":4,"n_rows":160,"n_cols":12,"rows_kept":160,"cut":false,"hidden":false,"merged":[[0,0,0,6],[0,7,0,11]]}
["JETNET Data",null,null,null,null,null,null,"FAA Registaration Data (4/7/2022)"]
["REGNBR","RELATIONTOAC","COMPANYNAME","COMPADDRESS1","COMPADDRESS2","COMPCITY","COMPSTATE",null,"NAME","STREET","CITY","STATE"]
["N150GV","Owner","Gulfstream Leasing, LLC","500 Gulfstream Road, Mail B-06",null,"Savannah","GA",{"$f":"A3","v":"N150GV"},{"$f":"INDEX(Sheet3!$I$1:$O$92,MATCH($A3,Sheet3!$I$1:$I$92,0),MATCH(I$2,Sheet3!$I$1:$O$1,0))","v":"GULFSTREAM LEASING LLC"},{"$f":"INDEX(Sheet3!$I$1:$O$92,MATCH($A3,Sheet3!$I$1:$I$92,0),MATCH(J$2,Sheet3!$I$1:$O$1,0))","v":"500 GULFSTREAM RD"},{"$f":"INDEX(Sheet3!$I$1:$O$92,MATCH($A3,Sheet3!$I$1:$I$92,0),MATCH(K$2,Sheet3!$I$1:$O$1,0))","v":"SAVANNAH"},{"$f":"INDEX(Sheet3!$I$1:$O$92,MATCH($A3,Sheet3!$I$1:$I$92,0),MATCH(L$2,Sheet3!$I$1:$O$1,0))","v":"GA"}]
["N703HA","Owner","Full Send Aviation, LLC","190 Raleigh Street",null,"Wilmington","NC",{"$f":"A4","v":"N703HA"},{"$f":"INDEX(Sheet3!$I$1:$O$92,MATCH($A4,Sheet3!$I$1:$I$92,0),MATCH(I$2,Sheet3!$I$1:$O$1,0))","v":"FULL SEND AVIATION LLC"},{"$f":"INDEX(Sheet3!$I$1:$O$92,MATCH($A4,Sheet3!$I$1:$I$92,0),MATCH(J$2,Sheet3!$I$1:$O$1,0))","v":"109 RALEIGH ST"},{"$f":"INDEX(Sheet3!$I$1:$O$92,MATCH($A4,Sheet3!$I$1:$I$92,0),MATCH(K$2,Sheet3!$I$1:$O$1,0))","v":"WILMINGTON"},{"$f":"INDEX(Sheet3!$I$1:$O$92,MATCH($A4,Sheet3!$I$1:$I$92,0),MATCH(L$2,Sheet3!$I$1:$O$1,0))","v":"NC"}]
["N530LD","Owner","4 Love of Flight, LLC","16150 Fitzhugh Road",null,"Dripping Springs","TX","N530LD",{"$f":"INDEX(Sheet3!$I$1:$O$92,MATCH($A5,Sheet3!$I$1:$I$92,0),MATCH(I$2,Sheet3!$I$1:$O$1,0))","v":"4 LOVE OF FLIGHT LLC"},{"$f":"INDEX(Sheet3!$I$1:$O$92,MATCH($A5,Sheet3!$I$1:$I$92,0),MATCH(J$2,Sheet3!$I$1:$O$1,0))","v":"16150 FITZHUGH RD"},{"$f":"INDEX(Sheet3!$I$1:$O$92,MATCH($A5,Sheet3!$I$1:$I$92,0),MATCH(K$2,Sheet3!$I$1:$O$1,0))","v":"DRIPPING SPRINGS"},{"$f":"INDEX(Sheet3!$I$1:$O$92,MATCH($A5,Sheet3!$I$1:$I$92,0),MATCH(L$2,Sheet3!$I$1:$O$1,0))","v":"TX"}]
["N7476C","Owner","Dodson International Parts, Inc.","2155 Vermont Road",null,"Rantoul","KS","N7476C",{"$f":"INDEX(Sheet3!$I$1:$O$92,MATCH($A6,Sheet3!$I$1:$I$92,0),MATCH(I$2,Sheet3!$I$1:$O$1,0))","v":{"$error":"#N/A"}},{"$f":"INDEX(Sheet3!$I$1:$O$92,MATCH($A6,Sheet3!$I$1:$I$92,0),MATCH(J$2,Sheet3!$I$1:$O$1,0))","v":{"$error":"#N/A"}},{"$f":"INDEX(Sheet3!$I$1:$O$92,MATCH($A6,Sheet3!$I$1:$I$92,0),MATCH(K$2,Sheet3!$I$1:$O$1,0))","v":{"$error":"#N/A"}},{"$f":"INDEX(Sheet3!$I$1:$O$92,MATCH($A6,Sheet3!$I$1:$I$92,0),MATCH(L$2,Sheet3!$I$1:$O$1,0))","v":{"$error":"#N/A"}}]
["N29JW","Operator","Schussboomer Systems, Inc.","P.O. Box 1420","317 Commercial Avenue","Anacortes","WA","N29JW",{"$f":"INDEX(Sheet3!$I$1:$O$92,MATCH($A7,Sheet3!$I$1:$I$92,0),MATCH(I$2,Sheet3!$I$1:$O$1,0))","v":"SCHUSSBOOMER SYSTEMS INC"},{"$f":"INDEX(Sheet3!$I$1:$O$92,MATCH($A7,Sheet3!$I$1:$I$92,0),MATCH(J$2,Sheet3!$I$1:$O$1,0))","v":"PO BOX 1420"},{"$f":"INDEX(Sheet3!$I$1:$O$92,MATCH($A7,Sheet3!$I$1:$I$92,0),MATCH(K$2,Sheet3!$I$1:$O$1,0))","v":"ANACORTES"},{"$f":"INDEX(Sheet3!$I$1:$O$92,MATCH($A7,Sheet3!$I$1:$I$92,0),MATCH(L$2,Sheet3!$I$1:$O$1,0))","v":"WA"}]
["N29JW","Owner","Schussboomer Systems, Inc.","P.O. Box 1420","317 Commercial Avenue","Anacortes","WA","N29JW",{"$f":"INDEX(Sheet3!$I$1:$O$92,MATCH($A8,Sheet3!$I$1:$I$92,0),MATCH(I$2,Sheet3!$I$1:$O$1,0))","v":"SCHUSSBOOMER SYSTEMS INC"},{"$f":"INDEX(Sheet3!$I$1:$O$92,MATCH($A8,Sheet3!$I$1:$I$92,0),MATCH(J$2,Sheet3!$I$1:$O$1,0))","v":"PO BOX 1420"},{"$f":"INDEX(Sheet3!$I$1:$O$92,MATCH($A8,Sheet3!$I$1:$I$92,0),MATCH(K$2,Sheet3!$I$1:$O$1,0))","v":"ANACORTES"},{"$f":"INDEX(Sheet3!$I$1:$O$92,MATCH($A8,Sheet3!$I$1:$I$92,0),MATCH(L$2,Sheet3!$I$1:$O$1,0))","v":"WA"}]
["N150QA","Operator","North Houston Pole Line","1608 Margaret Street",null,"Houston","TX","N150QA",{"$f":"INDEX(Sheet3!$I$1:$O$92,MATCH($A9,Sheet3!$I$1:$I$92,0),MATCH(I$2,Sheet3!$I$1:$O$1,0))","v":"TVPX AIRCRAFT SOLUTIONS INC TRUSTEE"},{"$f":"INDEX(Sheet3!$I$1:$O$92,MATCH($A9,Sheet3!$I$1:$I$92,0),MATCH(J$2,Sheet3!$I$1:$O$1,0))","v":"39 E EAGLE RIDGE DR STE 201"},{"$f":"INDEX(Sheet3!$I$1:$O$92,MATCH($A9,Sheet3!$I$1:$I$92,0),MATCH(K$2,Sheet3!$I$1:$O$1,0))","v":"NORTH SALT LAKE"},{"$f":"INDEX(Sheet3!$I$1:$O$92,MATCH($A9,Sheet3!$I$1:$I$92,0),MATCH(L$2,Sheet3!$I$1:$O$1,0))","v":"UT"}]
["N150QA","Owner","North Houston Pole Line","1608 Margaret Street",null,"Houston","TX","N150QA",{"$f":"INDEX(Sheet3!$I$1:$O$92,MATCH($A10,Sheet3!$I$1:$I$92,0),MATCH(I$2,Sheet3!$I$1:$O$1,0))","v":"TVPX AIRCRAFT SOLUTIONS INC TRUSTEE"},{"$f":"INDEX(Sheet3!$I$1:$O$92,MATCH($A10,Sheet3!$I$1:$I$92,0),MATCH(J$2,Sheet3!$I$1:$O$1,0))","v":"39 E EAGLE RIDGE DR STE 201"},{"$f":"INDEX(Sheet3!$I$1:$O$92,MATCH($A10,Sheet3!$I$1:$I$92,0),MATCH(K$2,Sheet3!$I$1:$O$1,0))","v":"NORTH SALT LAKE"},{"$f":"INDEX(Sheet3!$I$1:$O$92,MATCH($A10,Sheet3!$I$1:$I$92,0),MATCH(L$2,Sheet3!$I$1:$O$1,0))","v":"UT"}]
["N531GP","Owner","Blue Flag Two, Ltd.","P.O. Box 3806","110 N Main Street","Dayton","OH","N531GP",{"$f":"INDEX(Sheet3!$I$1:$O$92,MATCH($A11,Sheet3!$I$1:$I$92,0),MATCH(I$2,Sheet3!$I$1:$O$1,0))","v":"BLUE FLAG TWO LTD"},{"$f":"INDEX(Sheet3!$I$1:$O$92,MATCH($A11,Sheet3!$I$1:$I$92,0),MATCH(J$2,Sheet3!$I$1:$O$1,0))","v":"PO BOX 3806"},{"$f":"INDEX(Sheet3!$I$1:$O$92,MATCH($A11,Sheet3!$I$1:$I$92,0),MATCH(K$2,Sheet3!$I$1:$O$1,0))","v":"DAYTON"},{"$f":"INDEX(Sheet3!$I$1:$O$92,MATCH($A11,Sheet3!$I$1:$I$92,0),MATCH(L$2,Sheet3!$I$1:$O$1,0))","v":"OH"}]
["N150CT","Lessee","Promerica Financial Corporation","Calle 50 y 53 Este, Area Bancaria",null,"Panama City",null,"N150CT",{"$f":"INDEX(Sheet3!$I$1:$O$92,MATCH($A12,Sheet3!$I$1:$I$92,0),MATCH(I$2,Sheet3!$I$1:$O$1,0))","v":"BANK OF UTAH TRUSTEE"},{"$f":"INDEX(Sheet3!$I$1:$O$92,MATCH($A12,Sheet3!$I$1:$I$92,0),MATCH(J$2,Sheet3!$I$1:$O$1,0))","v":"50 S 200 E STE 110"},{"$f":"INDEX(Sheet3!$I$1:$O$92,MATCH($A12,Sheet3!$I$1:$I$92,0),MATCH(K$2,Sheet3!$I$1:$O$1,0))","v":"SALT LAKE CITY"},{"$f":"INDEX(Sheet3!$I$1:$O$92,MATCH($A12,Sheet3!$I$1:$I$92,0),MATCH(L$2,Sheet3!$I$1:$O$1,0))","v":"UT"}]
["N150CT","Owner","Leon Air, LLC","3191 Coral Way. Suite 800",null,"Miami","FL","N150CT",{"$f":"INDEX(Sheet3!$I$1:$O$92,MATCH($A13,Sheet3!$I$1:$I$92,0),MATCH(I$2,Sheet3!$I$1:$O$1,0))","v":"BANK OF UTAH TRUSTEE"},{"$f":"INDEX(Sheet3!$I$1:$O$92,MATCH($A13,Sheet3!$I$1:$I$92,0),MATCH(J$2,Sheet3!$I$1:$O$1,0))","v":"50 S 200 E STE 110"},{"$f":"INDEX(Sheet3!$I$1:$O$92,MATCH($A13,Sheet3!$I$1:$I$92,0),MATCH(K$2,Sheet3!$I$1:$O$1,0))","v":"SALT LAKE CITY"},{"$f":"INDEX(Sheet3!$I$1:$O$92,MATCH($A13,Sheet3!$I$1:$I$92,0),MATCH(L$2,Sheet3!$I$1:$O$1,0))","v":"UT"}]
["N209AW","Aircraft Management Company","Pinnacle Aviation, Inc.","14988 North 78th Way, Suite 106","Scottsdale Airport","Scottsdale","AZ","N209AW",{"$f":"INDEX(Sheet3!$I$1:$O$92,MATCH($A14,Sheet3!$I$1:$I$92,0),MATCH(I$2,Sheet3!$I$1:$O$1,0))","v":"BLUE STAR MANAGEMENT LLC"},{"$f":"INDEX(Sheet3!$I$1:$O$92,MATCH($A14,Sheet3!$I$1:$I$92,0),MATCH(J$2,Sheet3!$I$1:$O$1,0))","v":"PO BOX 686"},{"$f":"INDEX(Sheet3!$I$1:$O$92,MATCH($A14,Sheet3!$I$1:$I$92,0),MATCH(K$2,Sheet3!$I$1:$O$1,0))","v":"CRAIG"},{"$f":"INDEX(Sheet3!$I$1:$O$92,MATCH($A14,Sheet3!$I$1:$I$92,0),MATCH(L$2,Sheet3!$I$1:$O$1,0))","v":"AK"}]
["N209AW","Owner","Blue Star Management, LLC","P.O. Box 686","11.5 Mile Port St. Nicholas Road","Craig","AK","N209AW",{"$f":"INDEX(Sheet3!$I$1:$O$92,MATCH($A15,Sheet3!$I$1:$I$92,0),MATCH(I$2,Sheet3!$I$1:$O$1,0))","v":"BLUE STAR MANAGEMENT LLC"},{"$f":"INDEX(Sheet3!$I$1:$O$92,MATCH($A15,Sheet3!$I$1:$I$92,0),MATCH(J$2,Sheet3!$I$1:$O$1,0))","v":"PO BOX 686"},{"$f":"INDEX(Sheet3!$I$1:$O$92,MATCH($A15,Sheet3!$I$1:$I$92,0),MATCH(K$2,Sheet3!$I$1:$O$1,0))","v":"CRAIG"},{"$f":"INDEX(Sheet3!$I$1:$O$92,MATCH($A15,Sheet3!$I$1:$I$92,0),MATCH(L$2,Sheet3!$I$1:$O$1,0))","v":"AK"}]
{"$rows_left_out":146}
{"sheet":"JETNET Data","index":5,"n_rows":228,"n_cols":75,"rows_kept":228,"cut":false,"hidden":false,"merged":[]}
["MAKE","MODEL","SERNBR","REGNBR","Mining Number","ACBASEIATA","ACBASESTATE","ACBASECOUNTRY","RELATIONTOAC","COMPANYNAME","COMPADDRESS1","COMPADDRESS2","COMPCITY","COMPSTATE","COMPZIPCODE","COMPCOUNTRY","COMPPRIMEBUS","COMPEMAILADDRESS","COMPWEBADDRESS","COMPOFFICE","COMPMOBILE","CONTACTFIRSTNAME","CONTACTLASTNAME","CONTACTTITLE","CONTACTEMAIL","CONTACTBESTPHONE","CONTACTOFFICE","CONTACTMOBILE","\"Operator\"","Data","NAME","STREET","CITY","STATE","Column1","OTHER NAMES(1)","OTHER NAMES(2)","Part 135 Certificate Holder Name","Part 135 Dsgn","Column2","DNB Key People","POC","Title","Address","Column3","Phone","Email","Column4","NBAA Name","NBAA Addr1","NBAA Addr2","NBAA City","NBAA State","NBAA Zip","NBAA Phone","NBAA Web","NBAA email","NBAA NBAA Link","Certificate Designator","Company Name","CEO_Name","CEO_Title","CEO_Address1","CEO_Address2","CEO_Address3","CEO_City","CEO_State","CEO_Postal_Code","CEO_Country","CEO_Phone","CEO_Phone_Extension","CEO_Foreign_Phone","Company email Status","Contact email Status","Column5"]
["GULFSTREAM","G150",201,"N150GV","N150GV","SAV","GA","United States","Owner","Gulfstream Leasing, LLC","500 Gulfstream Road, Mail B-06",null,"Savannah","GA",31407,"United States","Aviation Related Business",null,null,"912-965-3293",null,"Richard","Chiariello","Member","Richard.Chiariello@gulfstream.com","912-965-3293",null,null,"Gulfstream Aerospace ",null,null,null,null,null,null,null,null,null,null,null,null,null,null,null,null,null,null,null,null,null,null,null,null,null,null,null,null,null,null,null,null,null,null,null,null,null,null,null,null,null,null,null,"","catch-all"]
["GULFSTREAM","G150",202,"N703HA","N703HA","ILM","NC","United States","Owner","Full Send Aviation, LLC","190 Raleigh Street",null,"Wilmington","NC",28412,"United States","End User",null,null,"910-859-8574",null,"Christopher","Scerri","Manager",null,"910-859-8574","910-859-8574",null,"","Full Send Aviation LLC, Wilmington NC bought 12/15/21","WASHINGTON PENN PLASTIC CO INC","450 RACETRACK RD","WASHINGTON","PA",{"$error":"#N/A"},"","","","",{"$error":"#N/A"},"","","","",{"$error":"#N/A"},"","",{"$error":"#N/A"},"","","","","","","","","","","","","","","","","","","","","","","","","",""]
["GULFSTREAM","G150",203,"N530LD","N530LD","FTY","GA","United States","Owner","4 Love of Flight, LLC","16150 Fitzhugh Road",null,"Dripping Springs","TX",78620,"United States","End User",null,null,null,"325-370-7389","Lou Ann","Davis","Managing Member",null,"325-370-7389",null,"325-370-7389","Jet Linx Aviation Inc. ","4 Love of Flight rrg 9/10/20","4 LOVE OF FLIGHT LLC","16150 FITZHUGH RD","DRIPPING SPRINGS","TX",{"$error":"#N/A"},"","","Jet Linx Aviation, LLC","9JLA",{"$error":"#N/A"},"https://www.corporationwiki.com/p/3459mm/4-love-of-flight-llc","","","",{"$error":"#N/A"},"","",{"$error":"#N/A"},"","","","","","","","","","","9JLA","JET LINX AVIATION LLC","WALKER, JAMIE","PRESIDENT AND CHIEF EXECUTIVE OFFICER","13030 Pierce St","SUITE 100","","OMAHA","NE","68144","US","4029918060","","","",""]
["GULFSTREAM","G150",204,"N7476C","N7476C",null,"KS","United States","Owner","Dodson International Parts, Inc.","2155 Vermont Road",null,"Rantoul","KS","66079-9014","United States","Dealer Broker","sales@dodson.com","www.dodson.com","785-878-4000",null,"Robert","(J.R.) Dodson","President","jr@dodson.com","785-878-8013","785-878-8013",null,"","Compass Aviation, Danbury CT bought 12/5/19","SALE REPORTED","2155 VERMONT RD","RANTOUL","KS",{"$error":"#N/A"},"","","","",{"$error":"#N/A"},"","","","",{"$error":"#N/A"},"","",{"$error":"#N/A"},"","","","","","","","","","","","","","","","","","","","","","","","","do_not_mail","valid"]
["GULFSTREAM","G150",205,"N29JW","N29JW","MVW","WA","United States","Operator","Schussboomer Systems, Inc.","P.O. Box 1420","317 Commercial Avenue","Anacortes","WA",98221,"United States","End User",null,null,null,"360-708-8516","Kevin","Welch","President","kevin@schussboomer.net","360-588-0574","360-588-0574",null,"","Schussboomer Systems Inc. Anacortes WA bought 12/13/18","SCHUSSBOOMER SYSTEMS INC","301 COMMERCIAL AVE","ANACORTES","WA",{"$error":"#N/A"},"","","","",{"$error":"#N/A"},"","","","",{"$error":"#N/A"},"","",{"$error":"#N/A"},"","","","","","","","","","","","","","","","","","","","","","","","","","catch-all"]
["GULFSTREAM","G150",205,"N29JW","N29JW","MVW","WA","United States","Owner","Schussboomer Systems, Inc.","P.O. Box 1420","317 Commercial Avenue","Anacortes","WA",98221,"United States","End User",null,null,null,"360-708-8516","Kevin","Welch","President","kevin@schussboomer.net","360-588-0574","360-588-0574",null,"","Schussboomer Systems Inc. Anacortes WA bought 12/13/18","SCHUSSBOOMER SYSTEMS INC","301 COMMERCIAL AVE","ANACORTES","WA",{"$error":"#N/A"},"","","","",{"$error":"#N/A"},"","","","",{"$error":"#N/A"},"","",{"$error":"#N/A"},"","","","","","","","","","","","","","","","","","","","","","","","","","catch-all"]
["GULFSTREAM","G150",206,"N150QA","N150CH","IAH","TX","United States","Operator","North Houston Pole Line","1608 Margaret Street",null,"Houston","TX",77093,"United States","End User",null,"https://www.nhplc.com","713-691-3616",null,"David","Meisel",null,"dmeisel@quantaservices.com","713-691-3616",null,null,"","North Houston Pole Line bought 4/23/21, rg 06/25/21 TVPX Trustee for Quanta Services","TVPX AIRCRAFT SOLUTIONS INC TRUSTEE","39 E EAGLE RIDGE DR STE 201","NORTH SALT LAKE","UT",{"$error":"#N/A"},"","","","",{"$error":"#N/A"},"","","","",{"$error":"#N/A"},"","",{"$error":"#N/A"},"","","","","","","","","","","","","","","","","","","","","","","","","","valid"]
["GULFSTREAM","G150",206,"N150QA","N150CH","IAH","TX","United States","Owner","North Houston Pole Line","1608 Margaret Street",null,"Houston","TX",77093,"United States","End User",null,"https://www.nhplc.com","713-691-3616",null,"Daren","Austin","President",null,"713-691-3616",null,null,"","North Houston Pole Line bought 4/23/21, rg 06/25/21 TVPX Trustee for Quanta Services","TVPX AIRCRAFT SOLUTIONS INC TRUSTEE","39 E EAGLE RIDGE DR STE 201","NORTH SALT LAKE","UT",{"$error":"#N/A"},"","","","",{"$error":"#N/A"},"","","","",{"$error":"#N/A"},"","",{"$error":"#N/A"},"","","","","","","","","","","","","","","","","","","","","","","","","",""]
["GULFSTREAM","G150",207,"N531GP","N531GP","FTY","GA","United States","Owner","Blue Flag Two, Ltd.","P.O. Box 3806","110 N Main Street","Dayton","OH",45401,"United States","End User",null,null,"937-974-7845",null,"Kenneth","Hemmelgarn","Manager",null,"937-974-7845","937-974-7845",null,"","Blue Flag Two Ltd, Dayton OH bought 9/25/19","BLUE FLAG TWO LTD","PO BOX 3806","DAYTON","OH",{"$error":"#N/A"},"","","","",{"$error":"#N/A"},"","","","",{"$error":"#N/A"},"","",{"$error":"#N/A"},"","","","","","","","","","","","","","","","","","","","","","","","","",""]
["GULFSTREAM","G150",208,"N150CT","N150CT","MIA","FL","United States","Lessee","Promerica Financial Corporation","Calle 50 y 53 Este, Area Bancaria",null,"Panama City",null,null,"Panama","End User",null,"www.grupopromerica.com","507-2642841",null,"Ramiro","Ortiz Mayorga","President",null,"507-2642841","507-2642841",null,"","Leon Air LLC bought 12/20/13","BANK OF UTAH TRUSTEE","50 S 200 E STE 110","SALT LAKE CITY","UT",{"$error":"#N/A"},"","","","",{"$error":"#N/A"},"","","","",{"$error":"#N/A"},"","",{"$error":"#N/A"},"","","","","","","","","","","","","","","","","","","","","","","","","",""]
["GULFSTREAM","G150",208,"N150CT","N150CT","MIA","FL","United States","Owner","Leon Air, LLC","3191 Coral Way. Suite 800",null,"Miami","FL",33145,"United States","End User",null,null,null,null,"Ramiro","Ortiz","President",null,null,null,null,"","Leon Air LLC bought 12/20/13","BANK OF UTAH TRUSTEE","50 S 200 E STE 110","SALT LAKE CITY","UT",{"$error":"#N/A"},"","","","",{"$error":"#N/A"},"","","","",{"$error":"#N/A"},"","",{"$error":"#N/A"},"","","","","","","","","","","","","","","","","","","","","","","","","",""]
["GULFSTREAM","G150",209,"N209AW","N209AW","SCF","AZ","United States","Aircraft Management Company","Pinnacle Aviation, Inc.","14988 North 78th Way, Suite 106","Scottsdale Airport","Scottsdale","AZ",85260,"United States","Dealer Broker","cp@pinnacleaviation.com","www.pinnacleaviation.com","480-998-8989",null,"Curt","Pavlicek","President","cp@pinnacleaviation.com","602-618-6200","480-998-8989","602-618-6200","","Blue Star Management LLC, Craig AK bought 7/27/21","BLUE STAR MANAGEMENT LLC","PO BOX 686","CRAIG","AK",{"$error":"#N/A"},"","","","",{"$error":"#N/A"},"","","","",{"$error":"#N/A"},"","",{"$error":"#N/A"},"","","","","","","","","","","","","","","","","","","","","","","","","catch-all","catch-all"]
["GULFSTREAM","G150",209,"N209AW","N209AW","SCF","AZ","United States","Owner","Blue Star Management, LLC","P.O. Box 686","11.5 Mile Port St. Nicholas Road","Craig","AK",99921,"United States","End User",null,null,"480-579-2424",null,"Kenneth","Palmer","Manager",null,"480-579-2424",null,null,"","Blue Star Management LLC, Craig AK bought 7/27/21","BLUE STAR MANAGEMENT LLC","PO BOX 686","CRAIG","AK",{"$error":"#N/A"},"","","","",{"$error":"#N/A"},"","","","",{"$error":"#N/A"},"","",{"$error":"#N/A"},"","","","","","","","","","","","","","","","","","","","","","","","","",""]
["GULFSTREAM","G150",210,"N428JD","N428JD","PDK","GA","United States","Owner","Dewberry Air, LLC","1545 Peachtree Street NE, Ste. 250",null,"Atlanta","GA",30309,"United States","End User",null,null,"404-888-7990",null,"John","Dewberry","Member","jdewberry@dewberrycapital.com","404-888-7990",null,null,"","Dewberry Air LLC, Atlanta GA bought 8/22/14, rrg 5/8/15","DEWBERRY AIR LLC","1545 PEACHTREE ST NW STE 250","ATLANTA","GA",{"$error":"#N/A"},"","","","",{"$error":"#N/A"},"","","","",{"$error":"#N/A"},"","",{"$error":"#N/A"},"","","","","","","","","","","","","","","","","","","","","","","","","","valid"]
{"$rows_left_out":213}