{"text_format":"1","workbook":"xlsx","n_sheets":7,"sheets":["AGG Income Summ 2022WIP","PARA Inv Recon 28DEC22WIP","AGG MemDistr CY2022","AGG BofA Credits CY2022","AGG BofA DebitsCat CY 2022","AGG BofA TransByDate CY2022","Documented Transactions by date"],"not_rendered":{"charts":0,"images":0,"macros":0,"external_links":1,"defined_names":5,"comments":0,"pivot_tables":0},"unopened":[],"bounds":{"document_bytes":16777216,"sheet_cells":100000,"rows_first":2000,"rows_last":500,"rows_between":2000,"halvings":0,"cell_chars":16384,"cell_head_chars":4096},"cells_cut":0,"cells_raw":0,"read":"whole","date_system":"1900"}

{"sheet":"AGG Income Summ 2022WIP","index":0,"n_rows":10,"n_cols":6,"rows_kept":10,"cut":false,"hidden":false,"merged":[[74,3,74,5],[75,3,75,5],[76,3,76,5],[77,3,77,5],[68,3,68,5],[69,3,69,5],[70,3,70,5],[71,3,71,5],[72,3,72,5],[73,3,73,5],[67,3,67,5],[56,3,56,5],[57,3,57,5],[58,3,58,5],[59,3,59,5],[60,3,60,5],[61,3,61,5],[62,3,62,5],[63,3,63,5],[64,3,64,5],[65,3,65,5],[66,3,66,5],[55,3,55,5],[44,3,44,5],[45,3,45,5],[46,3,46,5],[47,3,47,5],[48,3,48,5],[49,3,49,5],[50,3,50,5],[51,3,51,5],[52,3,52,5],[53,3,53,5],[54,3,54,5],[43,3,43,5],[32,3,32,5],[33,3,33,5],[34,3,34,5],[35,3,35,5],[36,3,36,5],[37,3,37,5],[38,3,38,5],[39,3,39,5],[40,3,40,5],[41,3,41,5],[42,3,42,5],[31,3,31,5],[20,3,20,5],[21,3,21,5],[22,3,22,5],[23,3,23,5],[24,3,24,5],[25,3,25,5],[26,3,26,5],[27,3,27,5],[28,3,28,5],[29,3,29,5],[30,3,30,5],[3,3,3,5],[19,3,19,5],[11,3,11,5],[12,3,12,5],[13,3,13,5],[9,3,9,5],[10,3,10,5],[14,3,14,5],[15,3,15,5],[16,3,16,5],[17,3,17,5],[18,3,18,5]]}
[]
[null,null,"AviaGlobal Group, LLC (AGG) Income CY 2022"]
[]
[null,null,{"$f":"C7+C9","v":34107.67},"Total 2022 Income Received by AGG"]
[null,null,"Amt","Client","Invoice","Description"]
[null,null,"AGG Client Consulting Services Income"]
[null,null,{"$f":"'PARA Inv Recon 28DEC22WIP'!D38","v":31000},"Peregrine Avionics",null,"AGG Monthy Retainer Services"]
[null,null,"AGG Client Expense Reimburement Income"]
[null,null,{"$f":"'PARA Inv Recon 28DEC22WIP'!D39","v":3107.67},"Peregrine Avionics",null,"WWW & Business Dvpt Services"]
[null,null,null,"Total 2022 Income Retainer & Reimbursement for AGG expenses incurred on behalf clients"]

{"sheet":"PARA Inv Recon 28DEC22WIP","index":1,"n_rows":39,"n_cols":9,"rows_kept":39,"cut":false,"hidden":false,"merged":[]}
[null,"Inv Month 2022","Description","Inv Number","Amount","AGG Inv & Sent Date","Due Date","Posted AGG BofA"]
[]
[null,"Dec 2021","WWW Support","030-21",1500,"2021-12-15","2022-01-01"]
[null,null,null,"Payment",1500,null,null,"2022-02-18"]
[null,"Jan","WWW Support","001-22",1500,"2022-01-15","2022-02-01"]
[null,null,null,"Payment",1500,null,null,"2022-01-24"]
[null,"Feb","WWW Support/ Enhanced","002-22",3000,"2022-02-15","2022-03-01"]
[null,null,"Expenses","003-22",850,"2022-02-21","2022-03-01",null,"JETNET"]
[null,null,null,"Payment",3850,null,null,"2022-03-17"]
[null,"Mar","WWW Support/ Enhanced","004-22",3000,"2022-03-15","2022-04-01"]
[null,null,"Expenses","005-22",106.69,"2022-03-15","2022-03-15",null,"Mailchimp"]
[null,null,"Expenses"," 006-22",450.41,"2022-03-23","2022-03-23",null,"Mailing"]
[null,null,null,"Payment",3557.1,null,null,"2022-04-20"]
[null,"Apr","WWW Support/ Enhanced","007-22",3000,"2022-04-18","2022-05-01"]
[null,null,null,"Payment",3000,null,null,"2022-07-08"]
[null,"May","WWW Support/ Enhanced","008-22",3000,"2022-05-26","2022-06-01"]
[null,null,null,"Payment",3000,null,null,"2022-08-08"]
[null,"Jun","WWW Support/ Enhanced","009-22",3000,"2022-06-16","2022-07-01"]
[null,"Jul","WWW Support/ Enhanced","010-22",3000,"2022-07-15","2022-08-01"]
[null,null,"Expenses","011-22",194.99,"2022-07-15","2022-07-15",null,"Mailcimp, images"]
{"$rows_left_out":20}
{"sheet":"AGG MemDistr CY2022","index":2,"n_rows":19,"n_cols":6,"rows_kept":19,"cut":false,"hidden":false,"merged":[[84,3,84,5],[85,3,85,5],[86,3,86,5],[81,3,81,5],[82,3,82,5],[83,3,83,5],[78,3,78,5],[79,3,79,5],[80,3,80,5],[75,3,75,5],[76,3,76,5],[77,3,77,5],[72,3,72,5],[73,3,73,5],[74,3,74,5],[69,3,69,5],[70,3,70,5],[71,3,71,5],[66,3,66,5],[67,3,67,5],[68,3,68,5],[63,3,63,5],[64,3,64,5],[65,3,65,5],[60,3,60,5],[61,3,61,5],[62,3,62,5],[57,3,57,5],[58,3,58,5],[59,3,59,5],[54,3,54,5],[55,3,55,5],[56,3,56,5],[51,3,51,5],[52,3,52,5],[53,3,53,5],[48,3,48,5],[49,3,49,5],[50,3,50,5],[45,3,45,5],[46,3,46,5],[47,3,47,5],[42,3,42,5],[43,3,43,5],[44,3,44,5],[39,3,39,5],[40,3,40,5],[41,3,41,5],[36,3,36,5],[37,3,37,5],[38,3,38,5],[33,3,33,5],[34,3,34,5],[35,3,35,5],[30,3,30,5],[31,3,31,5],[32,3,32,5],[27,3,27,5],[28,3,28,5],[29,3,29,5],[24,3,24,5],[25,3,25,5],[26,3,26,5],[22,3,22,5],[23,3,23,5],[18,3,18,5],[19,3,19,5],[20,3,20,5],[21,3,21,5],[3,3,3,5]]}
[]
[null,"AviaGlobal Group, LLC (AGG) Member Distributions CY 2022"]
[]
[null,{"$f":"B19","v":24000},null,"Total 2021 Income Distribution to AGG Memebers"]
[null,"Amount","Member Sum","Member","Distr Date","Description"]
[null,2000,null,"Aero Business Dvpt","2022-04-22","ACH Bank Transfer"]
[null,2700,null,"Aero Business Dvpt","2022-09-01","ACH Bank Transfer"]
[null,3300,null,"Aero Business Dvpt","2022-12-22","ACH Bank Transfer"]
[null,null,{"$f":"SUM(B6:B9)","v":8000},"Aero Business Dvpt",null,"ACH Bank Transfer"]
[null,2000,null,"ADS-B Global","2022-04-22","ACH Bank Transfer"]
[null,2700,null,"ADS-B Global","2022-09-01","ACH Bank Transfer"]
[null,3300,null,"ADS-B Global","2022-12-22","ACH Bank Transfer"]
[null,null,{"$f":"SUM(B10:B13)","v":8000},"ADS-B Global",null,"ACH Bank Transfer"]
[null,2000,null,"Forrest W. Colliver","2022-04-22","ACH Bank Transfer"]
[null,2700,null,"Forrest W. Colliver","2022-09-01","ACH Bank Transfer"]
[null,3300,null,"Forrest W. Colliver","2022-12-22","ACH Bank Transfer"]
[null,null,{"$f":"SUM(B14:B17)","v":8000},"Forrest W. Colliver",null,"ACH Bank Transfer"]
[]
[null,{"$f":"SUM(B6:B18)","v":24000},{"$f":"C9+C13+C17","v":24000},"Total 2022 AGG Member Distribution"]

{"sheet":"AGG BofA Credits CY2022","index":3,"n_rows":18,"n_cols":6,"rows_kept":18,"cut":false,"hidden":false,"merged":[]}
[]
["Description","Bank of America/ AviaGlobal Group LLC - Tax/Calendar Year 2022 Summary"]
[]
["Date","Revenue Summary By Payee (Credits)","Total Amount","Client Services Fee","Client Exp Reimbursment","Ref AGG Revenue Catagories"]
[]
["01/24/2022","PEREGRINE AVIONI DES:QUICKBOOKS ID:375020979 INDN:AVIAGLOBAL GROUP, LLC CO ID:1722616653 PPD",1500,{"$f":"C6","v":1500},null,"WWW Support Services"]
["02/18/2022","PEREGRINE AVIONI DES:QUICKBOOKS ID:375020979 INDN:AVIAGLOBAL GROUP, LLC CO ID:1722616653 PPD",1500,{"$f":"C7","v":1500},null,"WWW Support Services"]
["03/17/2022","PEREGRINE AVIONI DES:QUICKBOOKS ID:375020979 INDN:AVIAGLOBAL GROUP, LLC CO ID:1722616653 PPD",3850,3000,850,"WWW Support Services + Expenses"]
["04/20/2022","PEREGRINE AVIONI DES:QUICKBOOKS ID:375020979 INDN:AVIAGLOBAL GROUP, LLC CO ID:1722616653 PPD",3557.1,3000,557.1,"WWW Support Services"]
["2022-08-07","PEREGRINE AVIONI DES:QUICKBOOKS ID:375020979 INDN:AVIAGLOBAL GROUP, LLC CO ID:1722616653 PPD",3000,{"$f":"C10","v":3000},null,"WWW Support Services"]
["2022-08-08","PEREGRINE AVIONI DES:QUICKBOOKS ID:375020979 INDN:AVIAGLOBAL GROUP, LLC CO ID:1722616653 PPD",3000,{"$f":"C11","v":3000},null,"WWW Support Services"]
["08/31/2022","PEREGRINE AVIONI DES:QUICKBOOKS ID:375020979 INDN:AVIAGLOBAL GROUP, LLC CO ID:1722616653 PPD",3194.99,3000,194.99,"WWW Support Services + Expenses"]
["09/14/2022","PEREGRINE AVIONI DES:QUICKBOOKS ID:375020979 INDN:AVIAGLOBAL GROUP, LLC CO ID:1722616653 PPD",3000,{"$f":"C13","v":3000},null,"WWW Support Services"]
["2022-02-11","PEREGRINE AVIONI DES:QUICKBOOKS ID:375020979 INDN:AVIAGLOBAL GROUP, LLC CO ID:1722616653 PPD",2000,{"$f":"C14","v":2000},null,"WWW Support Services"]
["2022-09-12","PEREGRINE AVIONI DES:QUICKBOOKS ID:375020979 INDN:AVIAGLOBAL GROUP, LLC CO ID:1722616653 PPD",2000,2000,null,"WWW Support Services"]
["12/20/2022","PEREGRINE AVIONI DES:QUICKBOOKS ID:375020979 INDN:AVIAGLOBAL GROUP, LLC CO ID:1722616653 PPD",7063.61,6000,1063.6099999999999,"WWW Support Services + Expenses"]
[null,"Totals CY2022",{"$f":"SUM(C6:C16)","v":33665.699999999997},{"$f":"SUM(D6:D16)","v":31000},2665.7]
[null,null,{"$f":"D17+E17","v":33665.699999999997}]

{"sheet":"AGG BofA DebitsCat CY 2022","index":4,"n_rows":145,"n_cols":6,"rows_kept":145,"cut":false,"hidden":false,"merged":[]}
[]
["Description","Bank of America/ AviaGlobal Group LLC - Tax/Calendar Year 2021 Summary","Summary Amt."]
["Beginning balance as of 01/01/2021",null,3729.68]
["Total credits",null,80973.509999999995]
["Total debits",null,-84039.48]
["Ending balance as of 12/31/2021",null,663.71]
[]
["Date","Expense Summary By Catagory (Debits)","Amount","Cat Ttl","Category","Comments"]
[]
["2022-03-01","INTERNATIONAL TRANSACTION FEE 01/02 OWL FOR THUNDERBI WIESBADEN DEBIT CARD *7429",-0.34,null,"BofA Intl Fees"]
["01/25/2022","INTERNATIONAL TRANSACTION FEE 01/24 REALLY-SIMPLE-SSL GRONINGEN DEBIT CARD *7429",-0.7,null,"BofA Intl Fees"]
["01/24/2022","INTERNATIONAL TRANSACTION FEE 01/24 SOFTACULOUS ABU DHABI DEBIT CARD *7429",-0.72,null,"BofA Intl Fees"]
["01/26/2022","INTERNATIONAL TRANSACTION FEE 01/25 BLS*Single Card 972547584908 DEBIT CARD *7411",-0.21,null,"BofA Intl Fees"]
["01/25/2022","INTERNATIONAL TRANSACTION FEE 01/25 COMPLIANZ-GDPR-PR GRONINGEN DEBIT CARD *7429",-1.35,null,"BofA Intl Fees"]
["06/21/2022","INTERNATIONAL TRANSACTION FEE 06/20 COMPLIANZ-GDPR-PR GRONINGEN DEBIT CARD *7429",-1.35,null,"BofA Intl Fees"]
["06/21/2022","INTERNATIONAL TRANSACTION FEE 06/20 REALLY-SIMPLE-SSL GRONINGEN DEBIT CARD *7429",-0.7,null,"BofA Intl Fees"]
["2022-06-10","INTERNATIONAL TRANSACTION FEE 10/06 DOWNLOAD-MONITOR. BUCURESTI DEBIT CARD *7429",-4.7699999999999996,null,"BofA Intl Fees"]
["03/16/2022","External transfer fee - 3 Day - 03/15/2022 Confirmation: 379444042",-1,null,"BofA Ext Transfer Fees"]
["03/24/2022","External transfer fee - 3 Day - 03/23/2022 Confirmation: 380466874",-1,null,"BofA Ext Transfer Fees"]
["04/25/2022","External transfer fee - 3 Day - 04/22/2022 Confirmation: 384618918",-1,null,"BofA Ext Transfer Fees"]
{"$rows_left_out":126}
{"sheet":"AGG BofA TransByDate CY2022","index":5,"n_rows":130,"n_cols":4,"rows_kept":130,"cut":false,"hidden":false,"merged":[]}
[]
["Description","Bank of America/ AviaGlobal Group LLC - Tax/Calendar Year 2022 Summary","Summary Amt."]
["Beginning balance as of 01/01/2022",null,663.71]
["Total credits",null,33665.699999999997,{"$f":"SUM(C15,C28,C39,C55,C79,C85,C89,C97,C109,C116,C120)","v":33665.699999999997}]
["Total debits",null,-32129.360000000001,{"$f":"SUM(C10:C130)-D4","v":-32129.359999999993}]
["Ending balance as of 12/28/2022",null,2200.0500000000002]
[]
["Date","Description","Amount","Running Bal."]
["2022-01-01","Beginning balance as of 01/01/2022",null,663.71]
["2022-03-01","OWL FOR THUNDERBI 01/02 PURCHASE WIESBADEN DEBIT CARD *7429",-11.38,652.33000000000004]
["2022-03-01","Monthly Fee Business Adv Relationship",-29.95,622.38]
["2022-03-01","INTERNATIONAL TRANSACTION FEE 01/02 OWL FOR THUNDERBI WIESBADEN DEBIT CARD *7429",-0.34,622.04]
["01/19/2022","MAILCHIMP *MISC 01/18 PURCHASE MAILCHIMP.COM GA DEBIT CARD *7411",-9.49,612.54999999999995]
["01/20/2022","MailChimp 01/20 PURCHASE Atlanta GA DEBIT CARD *7411",-47.69,564.86]
["01/24/2022","PEREGRINE AVIONI DES:QUICKBOOKS ID:375020979 INDN:AVIAGLOBAL GROUP, LLC CO ID:1722616653 PPD",1500,2064.86]
["01/24/2022","SOFTACULOUS 01/24 PURCHASE ABU DHABI DEBIT CARD *7429",-24,2040.86]
["01/24/2022","ELEMENTOR 01/24 PURCHASE WILMINGTON DE DEBIT CARD *7429",-49,1991.86]
["01/24/2022","INTERNATIONAL TRANSACTION FEE 01/24 SOFTACULOUS ABU DHABI DEBIT CARD *7429",-0.72,1991.14]
["01/25/2022","REALLY-SIMPLE-SSL 01/24 PURCHASE GRONINGEN DEBIT CARD *7429",-23.2,1967.94]
["01/25/2022","COMPLIANZ-GDPR-PR 01/25 PURCHASE GRONINGEN DEBIT CARD *7429",-45,1922.94]
{"$rows_left_out":111}
{"sheet":"Documented Transactions by date","index":6,"n_rows":123,"n_cols":10,"rows_kept":123,"cut":false,"hidden":false,"merged":[]}
["Date","Description","Amount","Running Bal.","Who","Bill to","Column1","Expense Report?","Invoice","Charge Receipt"]
["2022-01-01","Beginning balance as of 01/01/2022",null,663.71,{"$f":"IFERROR(INDEX([1]Lookup!$B$2:$C$5,MATCH(RIGHT(TRIM(Table1[[#This Row],[Description]]),4),[1]Lookup!$B$2:$B$5,0),2),\"\")","v":""}]
["2022-01-03","OWL FOR THUNDERBI 01/02 PURCHASE WIESBADEN DEBIT CARD *7429",-11.38,{"$f":"D2+Table1[[#This Row],[Amount]]","v":652.33000000000004},{"$f":"IFERROR(INDEX([1]Lookup!$B$2:$C$5,MATCH(RIGHT(TRIM(Table1[[#This Row],[Description]]),4),[1]Lookup!$B$2:$B$5,0),2),\"\")","v":"FWC"},"AGG","Outook","221226 - FWC ER Mastercard EOY-2022","-"]
["2022-01-03","Monthly Fee Business Adv Relationship",-29.95,{"$f":"D3+Table1[[#This Row],[Amount]]","v":622.38},{"$f":"IFERROR(INDEX([1]Lookup!$B$2:$C$5,MATCH(RIGHT(TRIM(Table1[[#This Row],[Description]]),4),[1]Lookup!$B$2:$B$5,0),2),\"\")","v":""},"AGG",null,null,"-"]
["2022-01-03","INTERNATIONAL TRANSACTION FEE 01/02 OWL FOR THUNDERBI WIESBADEN DEBIT CARD *7429",-0.34,{"$f":"D4+Table1[[#This Row],[Amount]]","v":622.04},{"$f":"IFERROR(INDEX([1]Lookup!$B$2:$C$5,MATCH(RIGHT(TRIM(Table1[[#This Row],[Description]]),4),[1]Lookup!$B$2:$B$5,0),2),\"\")","v":"FWC"},"AGG","Outlook","221226 - FWC ER Mastercard EOY-2022","-",{"$f":"TEXT(Table1[[#This Row],[Date]],\"YYMMDD\")&\" - Intl Transaction Fee - \"&LEFT(RIGHT(Table1[[#This Row],[Description]],LEN(Table1[[#This Row],[Description]])-LEN(\"international transaction fee xx/xx \")),SEARCH(\"DEBIT\",RIGHT(Table1[[#This Row],[Description]],LEN(Table1[[#This Row],[Description]])-LEN(\"international transaction fee xx/xx xx\"))))&\".pdf\"","v":"220103 - Intl Transaction Fee - OWL FOR THUNDERBI WIESBADEN.pdf"}]
["2022-01-19","MAILCHIMP *MISC 01/18 PURCHASE MAILCHIMP.COM GA DEBIT CARD *7411",-9.49,{"$f":"D5+Table1[[#This Row],[Amount]]","v":612.54999999999995},{"$f":"IFERROR(INDEX([1]Lookup!$B$2:$C$5,MATCH(RIGHT(TRIM(Table1[[#This Row],[Description]]),4),[1]Lookup!$B$2:$B$5,0),2),\"\")","v":"LRC"},"AGG","Mailchimp","220310 - LRC ADS_BG ER MasterCard 04-2022","-","220118 - AGG - Mailchimp Essentials MC14760854.pdf"]
["2022-01-20","MailChimp 01/20 PURCHASE Atlanta GA DEBIT CARD *7411",-47.69,{"$f":"D6+Table1[[#This Row],[Amount]]","v":564.8599999999999},{"$f":"IFERROR(INDEX([1]Lookup!$B$2:$C$5,MATCH(RIGHT(TRIM(Table1[[#This Row],[Description]]),4),[1]Lookup!$B$2:$B$5,0),2),\"\")","v":"LRC"},"Peregrine","Mailchimp","220310 - LRC ADS_BG ER MasterCard Peregrine Billable 03-2022","005-22","220120 - Peregrine - Mailchimp Essentials MC14777938.pdf"]
["2022-01-24","PEREGRINE AVIONI DES:QUICKBOOKS ID:375020979 INDN:AVIAGLOBAL GROUP, LLC CO ID:1722616653 PPD",1500,{"$f":"D7+Table1[[#This Row],[Amount]]","v":2064.8599999999997},{"$f":"IFERROR(INDEX([1]Lookup!$B$2:$C$5,MATCH(RIGHT(TRIM(Table1[[#This Row],[Description]]),4),[1]Lookup!$B$2:$B$5,0),2),\"\")","v":""}]
["2022-01-24","SOFTACULOUS 01/24 PURCHASE ABU DHABI DEBIT CARD *7429",-24,{"$f":"D8+Table1[[#This Row],[Amount]]","v":2040.8599999999997},{"$f":"IFERROR(INDEX([1]Lookup!$B$2:$C$5,MATCH(RIGHT(TRIM(Table1[[#This Row],[Description]]),4),[1]Lookup!$B$2:$B$5,0),2),\"\")","v":"FWC"},"Peregrine","Security","221221 - FWC ER Peregrine Billable 1Q22",null,"220124 - Softaculous Loginizer 783150.pdf"]
["2022-01-24","ELEMENTOR 01/24 PURCHASE WILMINGTON DE DEBIT CARD *7429",-49,{"$f":"D9+Table1[[#This Row],[Amount]]","v":1991.8599999999997},{"$f":"IFERROR(INDEX([1]Lookup!$B$2:$C$5,MATCH(RIGHT(TRIM(Table1[[#This Row],[Description]]),4),[1]Lookup!$B$2:$B$5,0),2),\"\")","v":"FWC"},"Peregrine","CMS Editor","221221 - FWC ER Peregrine Billable 1Q22",null,"220124 - Elementor Pro.pdf"]
["2022-01-24","INTERNATIONAL TRANSACTION FEE 01/24 SOFTACULOUS ABU DHABI DEBIT CARD *7429",-0.72,{"$f":"D10+Table1[[#This Row],[Amount]]","v":1991.1399999999996},{"$f":"IFERROR(INDEX([1]Lookup!$B$2:$C$5,MATCH(RIGHT(TRIM(Table1[[#This Row],[Description]]),4),[1]Lookup!$B$2:$B$5,0),2),\"\")","v":"FWC"},"Peregrine","Fee","221221 - FWC ER Peregrine Billable 1Q22",null,{"$f":"TEXT(Table1[[#This Row],[Date]],\"YYMMDD\")&\" - Intl Transaction Fee - \"&LEFT(RIGHT(Table1[[#This Row],[Description]],LEN(Table1[[#This Row],[Description]])-LEN(\"international transaction fee xx/xx \")),SEARCH(\"DEBIT\",RIGHT(Table1[[#This Row],[Description]],LEN(Table1[[#This Row],[Description]])-LEN(\"international transaction fee xx/xx xx\"))))&\".pdf\"","v":"220124 - Intl Transaction Fee - SOFTACULOUS ABU DHABI.pdf"}]
["2022-01-25","REALLY-SIMPLE-SSL 01/24 PURCHASE GRONINGEN DEBIT CARD *7429",-23.2,{"$f":"D11+Table1[[#This Row],[Amount]]","v":1967.9399999999996},{"$f":"IFERROR(INDEX([1]Lookup!$B$2:$C$5,MATCH(RIGHT(TRIM(Table1[[#This Row],[Description]]),4),[1]Lookup!$B$2:$B$5,0),2),\"\")","v":"FWC"},"Peregrine","SSL Cert Manager","221221 - FWC ER Peregrine Billable 1Q22",null,"220124 - Really Simple SSL 2022-1993.pdf"]
["2022-01-25","COMPLIANZ-GDPR-PR 01/25 PURCHASE GRONINGEN DEBIT CARD *7429",-45,{"$f":"D12+Table1[[#This Row],[Amount]]","v":1922.9399999999996},{"$f":"IFERROR(INDEX([1]Lookup!$B$2:$C$5,MATCH(RIGHT(TRIM(Table1[[#This Row],[Description]]),4),[1]Lookup!$B$2:$B$5,0),2),\"\")","v":"FWC"},"Peregrine","Privacy Compliance","221221 - FWC ER Peregrine Billable 1Q22",null,"220125 - Complianz 2022-0745.pdf"]
["2022-01-25","INTERNATIONAL TRANSACTION FEE 01/25 COMPLIANZ-GDPR-PR GRONINGEN DEBIT CARD *7429",-1.35,{"$f":"D13+Table1[[#This Row],[Amount]]","v":1921.5899999999997},{"$f":"IFERROR(INDEX([1]Lookup!$B$2:$C$5,MATCH(RIGHT(TRIM(Table1[[#This Row],[Description]]),4),[1]Lookup!$B$2:$B$5,0),2),\"\")","v":"FWC"},"Peregrine","Fee","221221 - FWC ER Peregrine Billable 1Q22",null,{"$f":"TEXT(Table1[[#This Row],[Date]],\"YYMMDD\")&\" - Intl Transaction Fee - \"&LEFT(RIGHT(Table1[[#This Row],[Description]],LEN(Table1[[#This Row],[Description]])-LEN(\"international transaction fee xx/xx \")),SEARCH(\"DEBIT\",RIGHT(Table1[[#This Row],[Description]],LEN(Table1[[#This Row],[Description]])-LEN(\"international transaction fee xx/xx xx\"))))&\".pdf\"","v":"220125 - Intl Transaction Fee - COMPLIANZ-GDPR-PR GRONINGEN.pdf"}]
["2022-01-25","INTERNATIONAL TRANSACTION FEE 01/24 REALLY-SIMPLE-SSL GRONINGEN DEBIT CARD *7429",-0.7,{"$f":"D14+Table1[[#This Row],[Amount]]","v":1920.8899999999996},{"$f":"IFERROR(INDEX([1]Lookup!$B$2:$C$5,MATCH(RIGHT(TRIM(Table1[[#This Row],[Description]]),4),[1]Lookup!$B$2:$B$5,0),2),\"\")","v":"FWC"},"Peregrine","Fee","221221 - FWC ER Peregrine Billable 1Q22",null,{"$f":"TEXT(Table1[[#This Row],[Date]],\"YYMMDD\")&\" - Intl Transaction Fee - \"&LEFT(RIGHT(Table1[[#This Row],[Description]],LEN(Table1[[#This Row],[Description]])-LEN(\"international transaction fee xx/xx \")),SEARCH(\"DEBIT\",RIGHT(Table1[[#This Row],[Description]],LEN(Table1[[#This Row],[Description]])-LEN(\"international transaction fee xx/xx xx\"))))&\".pdf\"","v":"220125 - Intl Transaction Fee - REALLY-SIMPLE-SSL GRONINGEN.pdf"}]
["2022-01-26","BLS*Single Card 01/25 PURCHASE 972547584908 DEBIT CARD *7411",-6.99,{"$f":"D15+Table1[[#This Row],[Amount]]","v":1913.8999999999996},{"$f":"IFERROR(INDEX([1]Lookup!$B$2:$C$5,MATCH(RIGHT(TRIM(Table1[[#This Row],[Description]]),4),[1]Lookup!$B$2:$B$5,0),2),\"\")","v":"LRC"},"AGG",null,"220310 - LRC ADS_BG ER MasterCard 04-2022","-","220125 - Clear Coast Greetings Island 341592115.pdf"]
["2022-01-26","INTERNATIONAL TRANSACTION FEE 01/25 BLS*Single Card 972547584908 DEBIT CARD *7411",-0.21,{"$f":"D16+Table1[[#This Row],[Amount]]","v":1913.6899999999996},{"$f":"IFERROR(INDEX([1]Lookup!$B$2:$C$5,MATCH(RIGHT(TRIM(Table1[[#This Row],[Description]]),4),[1]Lookup!$B$2:$B$5,0),2),\"\")","v":"LRC"},"AGG",null,"220310 - LRC ADS_BG ER MasterCard 04-2022","-","220125 - Clear Coast Greetings Island 341592115.pdf"]
["2022-02-01","Monthly Fee Business Adv Relationship",-29.95,{"$f":"D17+Table1[[#This Row],[Amount]]","v":1883.7399999999996},{"$f":"IFERROR(INDEX([1]Lookup!$B$2:$C$5,MATCH(RIGHT(TRIM(Table1[[#This Row],[Description]]),4),[1]Lookup!$B$2:$B$5,0),2),\"\")","v":""},"AGG",null,null,"-"]
["2022-02-07","INMOTIONHOSTING.C 02/06 PURCHASE 888-3214678 CA DEBIT CARD *7429",-37.18,{"$f":"D18+Table1[[#This Row],[Amount]]","v":1846.5599999999995},{"$f":"IFERROR(INDEX([1]Lookup!$B$2:$C$5,MATCH(RIGHT(TRIM(Table1[[#This Row],[Description]]),4),[1]Lookup!$B$2:$B$5,0),2),\"\")","v":"FWC"},"AGG","Domain","221226 - FWC ER Mastercard EOY-2022","-"]
["2022-02-14","JET NET 02/10 PURCHASE 315-797-4420 NY DEBIT CARD *7411",-850,{"$f":"D19+Table1[[#This Row],[Amount]]","v":996.55999999999949},{"$f":"IFERROR(INDEX([1]Lookup!$B$2:$C$5,MATCH(RIGHT(TRIM(Table1[[#This Row],[Description]]),4),[1]Lookup!$B$2:$B$5,0),2),\"\")","v":"LRC"},"Peregrine",null,"220211 ‐ LRC ADS_BG ER MasterCard Peregrine Billable 02a‐2022","003-22","Executed Custom Special Report Project Agreement AviaGlobal Group LLC[84].pdf"]
{"$rows_left_out":103}