{"text_format":"1","workbook":"xlsx","n_sheets":7,"sheets":["Debit transactions","Peregrine transactions","Lookup","Sheet3","Sheet2","Sheet1","Sheet4"],"not_rendered":{"charts":0,"images":0,"macros":0,"external_links":0,"defined_names":8,"comments":0,"pivot_tables":0},"unopened":[],"bounds":{"document_bytes":16777216,"sheet_cells":100000,"rows_first":2000,"rows_last":500,"rows_between":2000,"halvings":0,"cell_chars":16384,"cell_head_chars":4096},"cells_cut":0,"cells_raw":0,"read":"whole","date_system":"1900"}

{"sheet":"Debit transactions","index":0,"n_rows":141,"n_cols":10,"rows_kept":141,"cut":false,"hidden":false,"merged":[]}
["Date","Description","Amount","Running Bal.","Who","Bill to","Column1","Expense Report?","Invoice","Charge Receipt"]
["2022-01-01","Beginning balance as of 01/01/2022",null,663.71,{"$f":"IFERROR(INDEX(Lookup!$B$2:$C$5,MATCH(RIGHT(TRIM(Table14[[#This Row],[Description]]),4),Lookup!$B$2:$B$5,0),2),\"\")","v":""}]
["2022-01-03","OWL FOR THUNDERBI 01/02 PURCHASE WIESBADEN DEBIT CARD *7429",-11.38,{"$f":"D2+Table14[[#This Row],[Amount]]","v":652.33000000000004},{"$f":"IFERROR(INDEX(Lookup!$B$2:$C$5,MATCH(RIGHT(TRIM(Table14[[#This Row],[Description]]),4),Lookup!$B$2:$B$5,0),2),\"\")","v":"FWC"},"AGG","Outlook","221226 - FWC ER Mastercard EOY-2022","-","220102 - OWL invoice 3-47107.pdf"]
["2022-01-03","Monthly Fee Business Adv Relationship",-29.95,{"$f":"D3+Table14[[#This Row],[Amount]]","v":622.38},{"$f":"IFERROR(INDEX(Lookup!$B$2:$C$5,MATCH(RIGHT(TRIM(Table14[[#This Row],[Description]]),4),Lookup!$B$2:$B$5,0),2),\"\")","v":""},"AGG",null,null,"-"]
["2022-01-03","INTERNATIONAL TRANSACTION FEE 01/02 OWL FOR THUNDERBI WIESBADEN DEBIT CARD *7429",-0.34,{"$f":"D4+Table14[[#This Row],[Amount]]","v":622.04},{"$f":"IFERROR(INDEX(Lookup!$B$2:$C$5,MATCH(RIGHT(TRIM(Table14[[#This Row],[Description]]),4),Lookup!$B$2:$B$5,0),2),\"\")","v":"FWC"},"AGG","Outlook","221226 - FWC ER Mastercard EOY-2022","-",{"$f":"TEXT(Table14[[#This Row],[Date]],\"YYMMDD\")&\" - Intl Transaction Fee - \"&LEFT(RIGHT(Table14[[#This Row],[Description]],LEN(Table14[[#This Row],[Description]])-LEN(\"international transaction fee xx/xx \")),SEARCH(\"DEBIT\",RIGHT(Table14[[#This Row],[Description]],LEN(Table14[[#This Row],[Description]])-LEN(\"international transaction fee xx/xx xx\"))))&\".pdf\"","v":"220103 - Intl Transaction Fee - OWL FOR THUNDERBI WIESBADEN.pdf"}]
["2022-01-19","MAILCHIMP *MISC 01/18 PURCHASE MAILCHIMP.COM GA DEBIT CARD *7411",-9.49,{"$f":"D5+Table14[[#This Row],[Amount]]","v":612.54999999999995},{"$f":"IFERROR(INDEX(Lookup!$B$2:$C$5,MATCH(RIGHT(TRIM(Table14[[#This Row],[Description]]),4),Lookup!$B$2:$B$5,0),2),\"\")","v":"LRC"},"AGG","Mailchimp","220310 - LRC ADS_BG ER MasterCard 04-2022","-","220118 - AGG - Mailchimp Essentials MC14760854.pdf"]
["2022-01-20","MailChimp 01/20 PURCHASE Atlanta GA DEBIT CARD *7411",-47.69,{"$f":"D6+Table14[[#This Row],[Amount]]","v":564.8599999999999},{"$f":"IFERROR(INDEX(Lookup!$B$2:$C$5,MATCH(RIGHT(TRIM(Table14[[#This Row],[Description]]),4),Lookup!$B$2:$B$5,0),2),\"\")","v":"LRC"},"Peregrine","Mailchimp","220310 - LRC ADS_BG ER MasterCard Peregrine Billable 03-2022","005-22","220120 - Peregrine - Mailchimp Essentials MC14777938.pdf"]
["2022-01-24","PEREGRINE AVIONI DES:QUICKBOOKS ID:375020979 INDN:AVIAGLOBAL GROUP, LLC CO ID:1722616653 PPD",1500,{"$f":"D7+Table14[[#This Row],[Amount]]","v":2064.8599999999997},{"$f":"IFERROR(INDEX(Lookup!$B$2:$C$5,MATCH(RIGHT(TRIM(Table14[[#This Row],[Description]]),4),Lookup!$B$2:$B$5,0),2),\"\")","v":""},"Peregrine"]
["2022-01-24","SOFTACULOUS 01/24 PURCHASE ABU DHABI DEBIT CARD *7429",-24,{"$f":"D8+Table14[[#This Row],[Amount]]","v":2040.8599999999997},{"$f":"IFERROR(INDEX(Lookup!$B$2:$C$5,MATCH(RIGHT(TRIM(Table14[[#This Row],[Description]]),4),Lookup!$B$2:$B$5,0),2),\"\")","v":"FWC"},"Peregrine","Security","221221 - FWC ER Peregrine Billable 1Q22","020-22","220124 - Softaculous Loginizer 783150.pdf"]
["2022-01-24","ELEMENTOR 01/24 PURCHASE WILMINGTON DE DEBIT CARD *7429",-49,{"$f":"D9+Table14[[#This Row],[Amount]]","v":1991.8599999999997},{"$f":"IFERROR(INDEX(Lookup!$B$2:$C$5,MATCH(RIGHT(TRIM(Table14[[#This Row],[Description]]),4),Lookup!$B$2:$B$5,0),2),\"\")","v":"FWC"},"Peregrine","CMS Editor","221221 - FWC ER Peregrine Billable 1Q22","020-22","220124 - Elementor Pro.pdf"]
["2022-01-24","INTERNATIONAL TRANSACTION FEE 01/24 SOFTACULOUS ABU DHABI DEBIT CARD *7429",-0.72,{"$f":"D10+Table14[[#This Row],[Amount]]","v":1991.1399999999996},{"$f":"IFERROR(INDEX(Lookup!$B$2:$C$5,MATCH(RIGHT(TRIM(Table14[[#This Row],[Description]]),4),Lookup!$B$2:$B$5,0),2),\"\")","v":"FWC"},"Peregrine","Fee","221221 - FWC ER Peregrine Billable 1Q22","020-22",{"$f":"TEXT(Table14[[#This Row],[Date]],\"YYMMDD\")&\" - Intl Transaction Fee - \"&LEFT(RIGHT(Table14[[#This Row],[Description]],LEN(Table14[[#This Row],[Description]])-LEN(\"international transaction fee xx/xx \")),SEARCH(\"DEBIT\",RIGHT(Table14[[#This Row],[Description]],LEN(Table14[[#This Row],[Description]])-LEN(\"international transaction fee xx/xx xx\"))))&\".pdf\"","v":"220124 - Intl Transaction Fee - SOFTACULOUS ABU DHABI.pdf"}]
["2022-01-25","REALLY-SIMPLE-SSL 01/24 PURCHASE GRONINGEN DEBIT CARD *7429",-23.2,{"$f":"D11+Table14[[#This Row],[Amount]]","v":1967.9399999999996},{"$f":"IFERROR(INDEX(Lookup!$B$2:$C$5,MATCH(RIGHT(TRIM(Table14[[#This Row],[Description]]),4),Lookup!$B$2:$B$5,0),2),\"\")","v":"FWC"},"Peregrine","SSL Cert Manager","221221 - FWC ER Peregrine Billable 1Q22","020-22","220124 - Really Simple SSL 2022-1993.pdf"]
["2022-01-25","COMPLIANZ-GDPR-PR 01/25 PURCHASE GRONINGEN DEBIT CARD *7429",-45,{"$f":"D12+Table14[[#This Row],[Amount]]","v":1922.9399999999996},{"$f":"IFERROR(INDEX(Lookup!$B$2:$C$5,MATCH(RIGHT(TRIM(Table14[[#This Row],[Description]]),4),Lookup!$B$2:$B$5,0),2),\"\")","v":"FWC"},"Peregrine","Privacy Compliance","221221 - FWC ER Peregrine Billable 1Q22","020-22","220125 - Complianz 2022-0745.pdf"]
["2022-01-25","INTERNATIONAL TRANSACTION FEE 01/25 COMPLIANZ-GDPR-PR GRONINGEN DEBIT CARD *7429",-1.35,{"$f":"D13+Table14[[#This Row],[Amount]]","v":1921.5899999999997},{"$f":"IFERROR(INDEX(Lookup!$B$2:$C$5,MATCH(RIGHT(TRIM(Table14[[#This Row],[Description]]),4),Lookup!$B$2:$B$5,0),2),\"\")","v":"FWC"},"Peregrine","Fee","221221 - FWC ER Peregrine Billable 1Q22","020-22",{"$f":"TEXT(Table14[[#This Row],[Date]],\"YYMMDD\")&\" - Intl Transaction Fee - \"&LEFT(RIGHT(Table14[[#This Row],[Description]],LEN(Table14[[#This Row],[Description]])-LEN(\"international transaction fee xx/xx \")),SEARCH(\"DEBIT\",RIGHT(Table14[[#This Row],[Description]],LEN(Table14[[#This Row],[Description]])-LEN(\"international transaction fee xx/xx xx\"))))&\".pdf\"","v":"220125 - Intl Transaction Fee - COMPLIANZ-GDPR-PR GRONINGEN.pdf"}]
["2022-01-25","INTERNATIONAL TRANSACTION FEE 01/24 REALLY-SIMPLE-SSL GRONINGEN DEBIT CARD *7429",-0.7,{"$f":"D14+Table14[[#This Row],[Amount]]","v":1920.8899999999996},{"$f":"IFERROR(INDEX(Lookup!$B$2:$C$5,MATCH(RIGHT(TRIM(Table14[[#This Row],[Description]]),4),Lookup!$B$2:$B$5,0),2),\"\")","v":"FWC"},"Peregrine","Fee","221221 - FWC ER Peregrine Billable 1Q22","020-22",{"$f":"TEXT(Table14[[#This Row],[Date]],\"YYMMDD\")&\" - Intl Transaction Fee - \"&LEFT(RIGHT(Table14[[#This Row],[Description]],LEN(Table14[[#This Row],[Description]])-LEN(\"international transaction fee xx/xx \")),SEARCH(\"DEBIT\",RIGHT(Table14[[#This Row],[Description]],LEN(Table14[[#This Row],[Description]])-LEN(\"international transaction fee xx/xx xx\"))))&\".pdf\"","v":"220125 - Intl Transaction Fee - REALLY-SIMPLE-SSL GRONINGEN.pdf"}]
{"$rows_left_out":127}
{"sheet":"Peregrine transactions","index":1,"n_rows":205,"n_cols":10,"rows_kept":205,"cut":false,"hidden":false,"merged":[]}
["Date","Description","Amount","Running Bal.","Who","Bill to","Column1","Expense Report?","Invoice","Charge Receipt"]
["2022-01-01","Beginning balance as of 01/01/2022",null,663.71,{"$f":"IFERROR(INDEX(Lookup!$B$2:$C$5,MATCH(RIGHT(TRIM(Table1[[#This Row],[Description]]),4),Lookup!$B$2:$B$5,0),2),\"\")","v":""}]
["2022-01-03","OWL FOR THUNDERBI 01/02 PURCHASE WIESBADEN DEBIT CARD *7429",-11.38,{"$f":"D2+Table1[[#This Row],[Amount]]","v":652.33000000000004},{"$f":"IFERROR(INDEX(Lookup!$B$2:$C$5,MATCH(RIGHT(TRIM(Table1[[#This Row],[Description]]),4),Lookup!$B$2:$B$5,0),2),\"\")","v":"FWC"},"AGG","Outlook","221226 - FWC ER Mastercard EOY-2022","-","220102 - OWL invoice 3-47107.pdf"]
["2022-01-03","Monthly Fee Business Adv Relationship",-29.95,{"$f":"D3+Table1[[#This Row],[Amount]]","v":622.38},{"$f":"IFERROR(INDEX(Lookup!$B$2:$C$5,MATCH(RIGHT(TRIM(Table1[[#This Row],[Description]]),4),Lookup!$B$2:$B$5,0),2),\"\")","v":""},"AGG",null,null,"-"]
["2022-01-03","INTERNATIONAL TRANSACTION FEE 01/02 OWL FOR THUNDERBI WIESBADEN DEBIT CARD *7429",-0.34,{"$f":"D4+Table1[[#This Row],[Amount]]","v":622.04},{"$f":"IFERROR(INDEX(Lookup!$B$2:$C$5,MATCH(RIGHT(TRIM(Table1[[#This Row],[Description]]),4),Lookup!$B$2:$B$5,0),2),\"\")","v":"FWC"},"AGG","Outlook","221226 - FWC ER Mastercard EOY-2022","-",{"$f":"TEXT(Table1[[#This Row],[Date]],\"YYMMDD\")&\" - Intl Transaction Fee - \"&LEFT(RIGHT(Table1[[#This Row],[Description]],LEN(Table1[[#This Row],[Description]])-LEN(\"international transaction fee xx/xx \")),SEARCH(\"DEBIT\",RIGHT(Table1[[#This Row],[Description]],LEN(Table1[[#This Row],[Description]])-LEN(\"international transaction fee xx/xx xx\"))))&\".pdf\"","v":"220103 - Intl Transaction Fee - OWL FOR THUNDERBI WIESBADEN.pdf"}]
["2022-01-19","MAILCHIMP *MISC 01/18 PURCHASE MAILCHIMP.COM GA DEBIT CARD *7411",-9.49,{"$f":"D5+Table1[[#This Row],[Amount]]","v":612.54999999999995},{"$f":"IFERROR(INDEX(Lookup!$B$2:$C$5,MATCH(RIGHT(TRIM(Table1[[#This Row],[Description]]),4),Lookup!$B$2:$B$5,0),2),\"\")","v":"LRC"},"AGG","Mailchimp","220310 - LRC ADS_BG ER MasterCard 04-2022","-","220118 - AGG - Mailchimp Essentials MC14760854.pdf"]
["2022-01-20","MailChimp 01/20 PURCHASE Atlanta GA DEBIT CARD *7411",-47.69,{"$f":"D6+Table1[[#This Row],[Amount]]","v":564.8599999999999},{"$f":"IFERROR(INDEX(Lookup!$B$2:$C$5,MATCH(RIGHT(TRIM(Table1[[#This Row],[Description]]),4),Lookup!$B$2:$B$5,0),2),\"\")","v":"LRC"},"Peregrine","Mailchimp","220310 - LRC ADS_BG ER MasterCard Peregrine Billable 03-2022","005-22","220120 - Peregrine - Mailchimp Essentials MC14777938.pdf"]
["2022-01-24","PEREGRINE AVIONI DES:QUICKBOOKS ID:375020979 INDN:AVIAGLOBAL GROUP, LLC CO ID:1722616653 PPD",1500,{"$f":"D7+Table1[[#This Row],[Amount]]","v":2064.8599999999997},{"$f":"IFERROR(INDEX(Lookup!$B$2:$C$5,MATCH(RIGHT(TRIM(Table1[[#This Row],[Description]]),4),Lookup!$B$2:$B$5,0),2),\"\")","v":""},"Peregrine"]
["2022-01-24","SOFTACULOUS 01/24 PURCHASE ABU DHABI DEBIT CARD *7429",-24,{"$f":"D8+Table1[[#This Row],[Amount]]","v":2040.8599999999997},{"$f":"IFERROR(INDEX(Lookup!$B$2:$C$5,MATCH(RIGHT(TRIM(Table1[[#This Row],[Description]]),4),Lookup!$B$2:$B$5,0),2),\"\")","v":"FWC"},"Peregrine","Security","221221 - FWC ER Peregrine Billable 1Q22","020-22","220124 - Softaculous Loginizer 783150.pdf"]
["2022-01-24","ELEMENTOR 01/24 PURCHASE WILMINGTON DE DEBIT CARD *7429",-49,{"$f":"D9+Table1[[#This Row],[Amount]]","v":1991.8599999999997},{"$f":"IFERROR(INDEX(Lookup!$B$2:$C$5,MATCH(RIGHT(TRIM(Table1[[#This Row],[Description]]),4),Lookup!$B$2:$B$5,0),2),\"\")","v":"FWC"},"Peregrine","CMS Editor","221221 - FWC ER Peregrine Billable 1Q22","020-22","220124 - Elementor Pro.pdf"]
["2022-01-24","INTERNATIONAL TRANSACTION FEE 01/24 SOFTACULOUS ABU DHABI DEBIT CARD *7429",-0.72,{"$f":"D10+Table1[[#This Row],[Amount]]","v":1991.1399999999996},{"$f":"IFERROR(INDEX(Lookup!$B$2:$C$5,MATCH(RIGHT(TRIM(Table1[[#This Row],[Description]]),4),Lookup!$B$2:$B$5,0),2),\"\")","v":"FWC"},"Peregrine","Fee","221221 - FWC ER Peregrine Billable 1Q22","020-22",{"$f":"TEXT(Table1[[#This Row],[Date]],\"YYMMDD\")&\" - Intl Transaction Fee - \"&LEFT(RIGHT(Table1[[#This Row],[Description]],LEN(Table1[[#This Row],[Description]])-LEN(\"international transaction fee xx/xx \")),SEARCH(\"DEBIT\",RIGHT(Table1[[#This Row],[Description]],LEN(Table1[[#This Row],[Description]])-LEN(\"international transaction fee xx/xx xx\"))))&\".pdf\"","v":"220124 - Intl Transaction Fee - SOFTACULOUS ABU DHABI.pdf"}]
["2022-01-25","REALLY-SIMPLE-SSL 01/24 PURCHASE GRONINGEN DEBIT CARD *7429",-23.2,{"$f":"D11+Table1[[#This Row],[Amount]]","v":1967.9399999999996},{"$f":"IFERROR(INDEX(Lookup!$B$2:$C$5,MATCH(RIGHT(TRIM(Table1[[#This Row],[Description]]),4),Lookup!$B$2:$B$5,0),2),\"\")","v":"FWC"},"Peregrine","SSL Cert Manager","221221 - FWC ER Peregrine Billable 1Q22","020-22","220124 - Really Simple SSL 2022-1993.pdf"]
["2022-01-25","COMPLIANZ-GDPR-PR 01/25 PURCHASE GRONINGEN DEBIT CARD *7429",-45,{"$f":"D12+Table1[[#This Row],[Amount]]","v":1922.9399999999996},{"$f":"IFERROR(INDEX(Lookup!$B$2:$C$5,MATCH(RIGHT(TRIM(Table1[[#This Row],[Description]]),4),Lookup!$B$2:$B$5,0),2),\"\")","v":"FWC"},"Peregrine","Privacy Compliance","221221 - FWC ER Peregrine Billable 1Q22","020-22","220125 - Complianz 2022-0745.pdf"]
["2022-01-25","INTERNATIONAL TRANSACTION FEE 01/25 COMPLIANZ-GDPR-PR GRONINGEN DEBIT CARD *7429",-1.35,{"$f":"D13+Table1[[#This Row],[Amount]]","v":1921.5899999999997},{"$f":"IFERROR(INDEX(Lookup!$B$2:$C$5,MATCH(RIGHT(TRIM(Table1[[#This Row],[Description]]),4),Lookup!$B$2:$B$5,0),2),\"\")","v":"FWC"},"Peregrine","Fee","221221 - FWC ER Peregrine Billable 1Q22","020-22",{"$f":"TEXT(Table1[[#This Row],[Date]],\"YYMMDD\")&\" - Intl Transaction Fee - \"&LEFT(RIGHT(Table1[[#This Row],[Description]],LEN(Table1[[#This Row],[Description]])-LEN(\"international transaction fee xx/xx \")),SEARCH(\"DEBIT\",RIGHT(Table1[[#This Row],[Description]],LEN(Table1[[#This Row],[Description]])-LEN(\"international transaction fee xx/xx xx\"))))&\".pdf\"","v":"220125 - Intl Transaction Fee - COMPLIANZ-GDPR-PR GRONINGEN.pdf"}]
["2022-01-25","INTERNATIONAL TRANSACTION FEE 01/24 REALLY-SIMPLE-SSL GRONINGEN DEBIT CARD *7429",-0.7,{"$f":"D14+Table1[[#This Row],[Amount]]","v":1920.8899999999996},{"$f":"IFERROR(INDEX(Lookup!$B$2:$C$5,MATCH(RIGHT(TRIM(Table1[[#This Row],[Description]]),4),Lookup!$B$2:$B$5,0),2),\"\")","v":"FWC"},"Peregrine","Fee","221221 - FWC ER Peregrine Billable 1Q22","020-22",{"$f":"TEXT(Table1[[#This Row],[Date]],\"YYMMDD\")&\" - Intl Transaction Fee - \"&LEFT(RIGHT(Table1[[#This Row],[Description]],LEN(Table1[[#This Row],[Description]])-LEN(\"international transaction fee xx/xx \")),SEARCH(\"DEBIT\",RIGHT(Table1[[#This Row],[Description]],LEN(Table1[[#This Row],[Description]])-LEN(\"international transaction fee xx/xx xx\"))))&\".pdf\"","v":"220125 - Intl Transaction Fee - REALLY-SIMPLE-SSL GRONINGEN.pdf"}]
{"$rows_left_out":191}
{"sheet":"Lookup","index":2,"n_rows":5,"n_cols":3,"rows_kept":5,"cut":false,"hidden":false,"merged":[]}
[]
[null,"Debit card","Who"]
[null,"0975","HEA"]
[null,"7411","LRC"]
[null,"7429","FWC"]

{"sheet":"Sheet3","index":3,"n_rows":8,"n_cols":10,"rows_kept":8,"cut":false,"hidden":false,"merged":[]}
["15‐Mar‐22 AGG MasterCard G150 campaign Stamps.com Mailing material 30.12$ US 1.00 30.12$ ",null,null,null,null,null,null,null,null,30.12]
["15‐Mar‐22 AGG MasterCard G150 campaign Amazon Brochure stock, envelopes 66.66$ US 1.00 66.66$ ",null,null,null,null,null,null,null,null,66.66]
["17‐Mar‐22 ADS‐B Global G150 campaign ADS‐B Glbl Brochure printing two‐sided color laser 180 US 0.50 90.00$ "]
["18‐Mar‐22 AGG MasterCard G150 campaign Stamps.com USPS STAMPS 50.00$ US 1.00 50.00$ ",null,null,null,null,null,null,null,null,50]
["18‐Mar‐22 AGG MasterCard G150 campaign Stamps.com USPS STAMPS 100.00$ US 1.00 100.00$ ",null,null,null,null,null,null,null,null,100]
["18‐Mar‐22 AGG MasterCard G150 campaign Amazon Brochure stock 29.63$ US 1.00 29.63$ ",null,null,null,null,null,null,null,null,29.63]
["20‐Mar‐22 AGG MasterCard Dues/Subscriptions Mailchimp Mailchimp Essentials 59.00$ US 1.00 59.00$ ",null,null,null,null,null,null,null,null,59]
["23‐Mar‐22 AGG MasterCard G150 campaign Stamps.com USPS STAMPS 25.00$ US 1.00 25.00",null,null,null,null,null,null,null,null,25]

{"sheet":"Sheet2","index":4,"n_rows":48,"n_cols":8,"rows_kept":48,"cut":false,"hidden":false,"merged":[]}
["Column1","Column2","Column3","Column4","Column5","Column6","Column7","Column8"]
[11.62,null,null,null,null,null,null," - AGG - Mailchimp Essentials "]
[]
["MC15956138 ",null,null,null,null,{"$f":"F8&$H$2&TRIM(A4)&\".pdf\"","v":"220618 - AGG - Mailchimp Essentials MC15956138.pdf"}]
[]
["Essentials plan (500 contacts)"]
[]
["Sat, Jun 18, 2022 3:18 am",null,null,null,{"$f":"DATEVALUE(MID(A8,6,12))","v":"2022-06-18"},{"$f":"TEXT(E8,\"YYMMDD\")","v":"220618"}]
[]
[11.62]
[]
["MC15724938 ",null,null,null,null,{"$f":"F16&$H$2&TRIM(A12)&\".pdf\"","v":"220518 - AGG - Mailchimp Essentials MC15724938.pdf"}]
[]
["Essentials plan (500 contacts)"]
[]
{"$rows_left_out":34}
{"sheet":"Sheet1","index":5,"n_rows":26,"n_cols":9,"rows_kept":26,"cut":false,"hidden":false,"merged":[]}
["W:\\$ AviaGlobalGroup\\AGG Finance\\AGG Credit Card Receipts\\*AGG*"]
[null,null,null,null,null,null,null,null,{"$f":"IFERROR(INDEX(ListOfFiles,ROW()-2),\"\")","v":""}]
[null,null,null,null,null,null,null,null,{"$f":"IFERROR(INDEX(ListOfFiles,ROW()-2),\"\")","v":""}]
[{"$f":"IFERROR(INDEX(FileNameList,ROW()-2),\"\")","v":""},null,null,null,null,null,null,null,{"$f":"IFERROR(INDEX(ListOfFiles,ROW()-2),\"\")","v":""}]
[null,null,null,null,null,null,null,null,{"$f":"IFERROR(INDEX(ListOfFiles,ROW()-2),\"\")","v":""}]
[null,null,null,null,null,null,null,null,{"$f":"IFERROR(INDEX(ListOfFiles,ROW()-2),\"\")","v":""}]
[null,null,null,null,null,null,null,null,{"$f":"IFERROR(INDEX(ListOfFiles,ROW()-2),\"\")","v":""}]
[null,null,null,null,null,null,null,null,{"$f":"IFERROR(INDEX(ListOfFiles,ROW()-2),\"\")","v":""}]
[null,null,null,null,null,null,null,null,{"$f":"IFERROR(INDEX(ListOfFiles,ROW()-2),\"\")","v":""}]
[null,null,null,null,null,null,null,null,{"$f":"IFERROR(INDEX(ListOfFiles,ROW()-2),\"\")","v":""}]
[null,null,null,null,null,null,null,null,{"$f":"IFERROR(INDEX(ListOfFiles,ROW()-2),\"\")","v":""}]
[null,null,null,null,null,null,null,null,{"$f":"IFERROR(INDEX(ListOfFiles,ROW()-2),\"\")","v":""}]
[null,null,null,null,null,null,null,null,{"$f":"IFERROR(INDEX(ListOfFiles,ROW()-2),\"\")","v":""}]
[null,null,null,null,null,null,null,null,{"$f":"IFERROR(INDEX(ListOfFiles,ROW()-2),\"\")","v":""}]
[null,null,null,null,null,null,null,null,{"$f":"IFERROR(INDEX(ListOfFiles,ROW()-2),\"\")","v":""}]
{"$rows_left_out":12}
{"sheet":"Sheet4","index":6,"n_rows":56,"n_cols":14,"rows_kept":56,"cut":false,"hidden":false,"merged":[]}
[null,"AGG MC","Adder","Total",null,null,null,"Invoice Month",null,"Invoice Number","Invoice ","Amount","Invoice Date","Posted"]
["-",{"$f":"-SUMIFS('Peregrine transactions'!$C$1:$C$144,'Peregrine transactions'!$I$1:$I$144,Sheet4!A2,'Peregrine transactions'!$F$1:$F$144,\"Peregrine\")","v":0},null,{"$f":"B2+C2","v":0},null,null,null,null,null,null,null,4138]
["002-23",{"$f":"-SUMIFS('Peregrine transactions'!$C$1:$C$144,'Peregrine transactions'!$I$1:$I$144,Sheet4!A3,'Peregrine transactions'!$F$1:$F$144,\"Peregrine\")","v":138},null,{"$f":"B3+C3","v":138},null,null,null,"Feb?","WWW Support/ Enhanced","AGGPERAPA Inv 002-22",{"$f":"RIGHT(J3,6)","v":"002-22"},3000,"2022-02-15","2022-03-17"]
["006-22",{"$f":"-SUMIFS('Peregrine transactions'!$C$1:$C$144,'Peregrine transactions'!$I$1:$I$144,Sheet4!A4,'Peregrine transactions'!$F$1:$F$144,\"Peregrine\")","v":360.41},90,{"$f":"B4+C4","v":450.41},true,null,null,null,"Expenses","AGGPERAPA ERInv 003-22",{"$f":"RIGHT(J4,6)","v":"003-22"},850,"2022-02-21","2022-03-17"]
["011-22",{"$f":"-SUMIFS('Peregrine transactions'!$C$1:$C$144,'Peregrine transactions'!$I$1:$I$144,Sheet4!A5,'Peregrine transactions'!$F$1:$F$144,\"Peregrine\")","v":194.99},null,{"$f":"B5+C5","v":194.99},true,null,null,null,null,"Payment",null,-3850,null,"2022-03-17"]
["015-22",{"$f":"-SUMIFS('Peregrine transactions'!$C$1:$C$144,'Peregrine transactions'!$I$1:$I$144,Sheet4!A6,'Peregrine transactions'!$F$1:$F$144,\"Peregrine\")","v":236},null,{"$f":"B6+C6","v":236},true,null,null,"Mar?","WWW Support/ Enhanced","AGGPERAPA Inv 004-22",{"$f":"RIGHT(J6,6)","v":"004-22"},3000,"2022-03-15","2022-04-20"]
["017-22",{"$f":"-SUMIFS('Peregrine transactions'!$C$1:$C$144,'Peregrine transactions'!$I$1:$I$144,Sheet4!A7,'Peregrine transactions'!$F$1:$F$144,\"Peregrine\")","v":59},null,{"$f":"B7+C7","v":59},true,null,null,null,"Expenses","AGGPERAPA ERInv 005-22","005-22",106.69,"2022-03-15","2022-04-20"]
["018-22",{"$f":"-SUMIFS('Peregrine transactions'!$C$1:$C$144,'Peregrine transactions'!$I$1:$I$144,Sheet4!A8,'Peregrine transactions'!$F$1:$F$144,\"Peregrine\")","v":643.62},124.99,{"$f":"B8+C8","v":768.61},true,null,null,null,"Expenses","AGGPERAPA ERInv 006-22","006-22",450.41,"2022-03-23","2022-04-20"]
["020-22",{"$f":"-SUMIFS('Peregrine transactions'!$C$1:$C$144,'Peregrine transactions'!$I$1:$I$144,Sheet4!A9,'Peregrine transactions'!$F$1:$F$144,\"Peregrine\")","v":441.97},null,{"$f":"B9+C9","v":441.97},true,null,null,null,null,"Payment",null,-3557.1,null,"2022-04-20"]
[null,null,null,null,null,null,null,"Apr?","WWW Support/ Enhanced","AGGPERAPA Inv 007-22",{"$f":"RIGHT(J10,6)","v":"007-22"},3000,"2022-04-18","2022-07-08"]
[null,"AGG MC","Adder","Retainer","Total",null,null,null,null,"Payment",null,-3000,null,"2022-07-08"]
["001-22",null,null,1500,{"$f":"SUM(B12:D12)","v":1500},{"$f":"E12","v":1500},null,"May?","WWW Support/ Enhanced","AGGPERAPA Inv 008-22",{"$f":"RIGHT(J12,6)","v":"008-22"},3000,"2022-05-26","2022-08-08"]
["001-22",null,null,1500,{"$f":"SUM(B13:D13)","v":1500},{"$f":"E13","v":1500},null,null,null,"Payment",null,-3000,null,"2022-08-08"]
["002-22",{"$f":"IFERROR(INDEX($A$2:$D$9,MATCH(A14,$A$2:$A$9,0),2),0)","v":0},{"$f":"IFERROR(INDEX($A$2:$D$9,MATCH(A14,$A$2:$A$9,0),3),0)","v":0},3000,{"$f":"SUM(B14:D14)","v":3000},{"$f":"E14","v":3000},null,"Jun?","WWW Support/ Enhanced","AGGPERAPA Inv 009-22",{"$f":"RIGHT(J14,6)","v":"009-22"},3000,"2022-06-16","2022-08-31"]
["003-22",850,0,null,{"$f":"SUM(B15:D15)","v":850},{"$f":"-E15","v":-850},null,null,"Expenses","AGGPERAPA ERInv 011-22","011-22",194.99,"2022-07-15","2022-08-31"]
{"$rows_left_out":41}