{"text_format":"1","workbook":"xlsx","n_sheets":7,"sheets":["Sheet1","Sheet3","Sheet2","Sheet4","airbus 2018","statista 2021","Aircraft Pricing"],"not_rendered":{"charts":0,"images":2,"macros":0,"external_links":0,"defined_names":3,"comments":0,"pivot_tables":0},"unopened":[],"bounds":{"document_bytes":16777216,"sheet_cells":100000,"rows_first":2000,"rows_last":500,"rows_between":2000,"halvings":0,"cell_chars":16384,"cell_head_chars":4096},"cells_cut":0,"cells_raw":0,"read":"whole","date_system":"1900"}

{"sheet":"Sheet1","index":0,"n_rows":45,"n_cols":16,"rows_kept":45,"cut":false,"hidden":false,"merged":[]}
["Make Model","Type","family","Engine","Range","PAX","Text $","Price ($M)",null,"Market value","source"]
["BOEING 737-MAX 7",{"$f":"TRIM(RIGHT(A2,LEN(A2)-SEARCH(\" \",A2)))","v":"737-MAX 7"},"737",null,null,172,"$99.7M",{"$f":"VALUE(LEFT(G2,LEN(G2)-1))","v":99.7},{"$f":"INDEX(Sheet3!$A$1:$B$21,MATCH(RIGHT(A2,LEN(A2)-SEARCH(\" \",A2)),Sheet3!$A$1:$A$21,0),2)","v":{"$error":"#N/A"}},{"$f":"H2/2","v":49.85},"http://www.axonaviation.com/commercial-aircraft/aircraft-data/aircraft-pricing",{"$f":"INDEX('Aircraft Pricing'!$A:$F,MATCH(A2&\"^\"&D2&\"^\"&E2&\"^\"&F2&\"^\"&G2,'Aircraft Pricing'!$F:$F,0),5)","v":{"$error":"#N/A"}}]
["Airbus A220-100",{"$f":"RIGHT(A3,LEN(A3)-SEARCH(\" \",A3))","v":"A220-100"},"A220",null,null,null,"$81.0M",{"$f":"VALUE(LEFT(G3,LEN(G3)-1))","v":81},{"$f":"INDEX(Sheet3!$A$1:$B$21,MATCH(RIGHT(A3,LEN(A3)-SEARCH(\" \",A3)),Sheet3!$A$1:$A$21,0),2)","v":{"$error":"#N/A"}},{"$f":"H3/2","v":40.5},"https://simpleflying.com/how-much-do-airbus-aircraft-cost/",{"$f":"INDEX('Aircraft Pricing'!$A:$F,MATCH(A3&\"^\"&D3&\"^\"&E3&\"^\"&F3&\"^\"&G3,'Aircraft Pricing'!$F:$F,0),5)","v":{"$error":"#N/A"}}]
["Airbus A220-300","A220-300","A220",null,null,null,"$91.5M",91.5,{"$f":"INDEX(Sheet3!$A$1:$B$21,MATCH(RIGHT(A4,LEN(A4)-SEARCH(\" \",A4)),Sheet3!$A$1:$A$21,0),2)","v":{"$error":"#N/A"}},{"$f":"H4/2","v":45.75},"https://simpleflying.com/how-much-do-airbus-aircraft-cost/",{"$f":"INDEX('Aircraft Pricing'!$A:$F,MATCH(A4&\"^\"&D4&\"^\"&E4&\"^\"&F4&\"^\"&G4,'Aircraft Pricing'!$F:$F,0),5)","v":{"$error":"#N/A"}}]
["Airbus A318","A318","A320","GE, Pratt & Whitney","3,100 NM",107,"$75.1M",75.099999999999994,{"$f":"INDEX(Sheet3!$A$1:$B$21,MATCH(RIGHT(A5,LEN(A5)-SEARCH(\" \",A5)),Sheet3!$A$1:$A$21,0),2)","v":{"$error":"#N/A"}},{"$f":"H5/2","v":37.549999999999997},"http://www.axonaviation.com/commercial-aircraft/aircraft-data/aircraft-pricing",{"$f":"INDEX('Aircraft Pricing'!$A:$F,MATCH(A5&\"^\"&D5&\"^\"&E5&\"^\"&F5&\"^\"&G5,'Aircraft Pricing'!$F:$F,0),5)","v":"$75.1M"}]
["Airbus A319","A319","A320","GE, International Aero Engines","3,700 nm",124,"$89.6M",89.6,{"$f":"INDEX(Sheet3!$A$1:$B$21,MATCH(RIGHT(A6,LEN(A6)-SEARCH(\" \",A6)),Sheet3!$A$1:$A$21,0),2)","v":{"$error":"#N/A"}},{"$f":"H6/2","v":44.8},"http://www.axonaviation.com/commercial-aircraft/aircraft-data/aircraft-pricing",{"$f":"INDEX('Aircraft Pricing'!$A:$F,MATCH(A6&\"^\"&D6&\"^\"&E6&\"^\"&F6&\"^\"&G6,'Aircraft Pricing'!$F:$F,0),5)","v":"$89.6M"}]
["Airbus A319NEO","A319NEO","A320",null,null,null,"$101.5M",101.5,{"$f":"INDEX(Sheet3!$A$1:$B$21,MATCH(RIGHT(A7,LEN(A7)-SEARCH(\" \",A7)),Sheet3!$A$1:$A$21,0),2)","v":{"$error":"#N/A"}},50.75,"https://simpleflying.com/how-much-do-airbus-aircraft-cost/",{"$f":"INDEX('Aircraft Pricing'!$A:$F,MATCH(A7&\"^\"&D7&\"^\"&E7&\"^\"&F7&\"^\"&G7,'Aircraft Pricing'!$F:$F,0),5)","v":{"$error":"#N/A"}}]
["Airbus A320","A320","A320","GE, International Aero Engines","3,300 NM",150,"$98M",98,{"$f":"INDEX(Sheet3!$A$1:$B$21,MATCH(RIGHT(A8,LEN(A8)-SEARCH(\" \",A8)),Sheet3!$A$1:$A$21,0),2)","v":{"$error":"#N/A"}},49,"http://www.axonaviation.com/commercial-aircraft/aircraft-data/aircraft-pricing",{"$f":"INDEX('Aircraft Pricing'!$A:$F,MATCH(A8&\"^\"&D8&\"^\"&E8&\"^\"&F8&\"^\"&G8,'Aircraft Pricing'!$F:$F,0),5)","v":"$98M"}]
["Airbus A321","A321","A320","GE, International Aero Engines","3,200 NM",185,"$114.9M",114.9,{"$f":"INDEX(Sheet3!$A$1:$B$21,MATCH(RIGHT(A9,LEN(A9)-SEARCH(\" \",A9)),Sheet3!$A$1:$A$21,0),2)","v":{"$error":"#N/A"}},{"$f":"H9/2","v":57.45},"http://www.axonaviation.com/commercial-aircraft/aircraft-data/aircraft-pricing",{"$f":"INDEX('Aircraft Pricing'!$A:$F,MATCH(A9&\"^\"&D9&\"^\"&E9&\"^\"&F9&\"^\"&G9,'Aircraft Pricing'!$F:$F,0),5)","v":"$114.9M"}]
["Airbus A321NEO","A321NEO","A320",null,null,null,"$129.5M",129.5,{"$f":"INDEX(Sheet3!$A$1:$B$21,MATCH(RIGHT(A10,LEN(A10)-SEARCH(\" \",A10)),Sheet3!$A$1:$A$21,0),2)","v":{"$error":"#N/A"}},64.75,"https://simpleflying.com/how-much-do-airbus-aircraft-cost/",{"$f":"INDEX('Aircraft Pricing'!$A:$F,MATCH(A10&\"^\"&D10&\"^\"&E10&\"^\"&F10&\"^\"&G10,'Aircraft Pricing'!$F:$F,0),5)","v":{"$error":"#N/A"}}]
["Airbus A330-200","A330-200","A330/340","ROLLS-ROYCE, GE, Pratt & Whitney","7,250 NM",247,"$231.5M",231.5,{"$f":"INDEX(Sheet3!$A$1:$B$21,MATCH(RIGHT(A11,LEN(A11)-SEARCH(\" \",A11)),Sheet3!$A$1:$A$21,0),2)","v":{"$error":"#N/A"}},115.75,"http://www.axonaviation.com/commercial-aircraft/aircraft-data/aircraft-pricing",{"$f":"INDEX('Aircraft Pricing'!$A:$F,MATCH(A11&\"^\"&D11&\"^\"&E11&\"^\"&F11&\"^\"&G11,'Aircraft Pricing'!$F:$F,0),5)","v":"$231.5M"}]
["Airbus A330-200F","A330-200F","A330/340","Pratt & Whitney, ROLLS-ROYCE","4,000 NM","N/A","$234.7M",234.7,{"$f":"INDEX(Sheet3!$A$1:$B$21,MATCH(RIGHT(A12,LEN(A12)-SEARCH(\" \",A12)),Sheet3!$A$1:$A$21,0),2)","v":{"$error":"#N/A"}},117.35,"http://www.axonaviation.com/commercial-aircraft/aircraft-data/aircraft-pricing",{"$f":"INDEX('Aircraft Pricing'!$A:$F,MATCH(A12&\"^\"&D12&\"^\"&E12&\"^\"&F12&\"^\"&G12,'Aircraft Pricing'!$F:$F,0),5)","v":"$234.7M"}]
["Airbus A330-300","A330-300","A330/340","ROLLS-ROYCE, GE, Pratt & Whitney","6,350 NM",277,"$256.4M",256.39999999999998,{"$f":"INDEX(Sheet3!$A$1:$B$21,MATCH(RIGHT(A13,LEN(A13)-SEARCH(\" \",A13)),Sheet3!$A$1:$A$21,0),2)","v":{"$error":"#N/A"}},{"$f":"H13/2","v":128.19999999999999},"http://www.axonaviation.com/commercial-aircraft/aircraft-data/aircraft-pricing",{"$f":"INDEX('Aircraft Pricing'!$A:$F,MATCH(A13&\"^\"&D13&\"^\"&E13&\"^\"&F13&\"^\"&G13,'Aircraft Pricing'!$F:$F,0),5)","v":"$256.4M"}]
["Airbus A330-800NEO","A330-800NEO","A330/340",null,null,null,"$259.9M",259.89999999999998,{"$f":"INDEX(Sheet3!$A$1:$B$21,MATCH(RIGHT(A14,LEN(A14)-SEARCH(\" \",A14)),Sheet3!$A$1:$A$21,0),2)","v":{"$error":"#N/A"}},129.94999999999999,"https://simpleflying.com/how-much-do-airbus-aircraft-cost/",{"$f":"INDEX('Aircraft Pricing'!$A:$F,MATCH(A14&\"^\"&D14&\"^\"&E14&\"^\"&F14&\"^\"&G14,'Aircraft Pricing'!$F:$F,0),5)","v":{"$error":"#N/A"}}]
["Airbus A330-900NEO","A330-900NEO","A330/340",null,null,null,"$296.4M",296.39999999999998,{"$f":"INDEX(Sheet3!$A$1:$B$21,MATCH(RIGHT(A15,LEN(A15)-SEARCH(\" \",A15)),Sheet3!$A$1:$A$21,0),2)","v":{"$error":"#N/A"}},{"$f":"H15/2","v":148.19999999999999},"https://simpleflying.com/how-much-do-airbus-aircraft-cost/",{"$f":"INDEX('Aircraft Pricing'!$A:$F,MATCH(A15&\"^\"&D15&\"^\"&E15&\"^\"&F15&\"^\"&G15,'Aircraft Pricing'!$F:$F,0),5)","v":{"$error":"#N/A"}}]
["Airbus A340-300","A340-300","A330/340","CFM International","7,300 NM",277,"$219M",219,{"$f":"INDEX(Sheet3!$A$1:$B$21,MATCH(RIGHT(A16,LEN(A16)-SEARCH(\" \",A16)),Sheet3!$A$1:$A$21,0),2)","v":{"$error":"#N/A"}},109.5,"http://www.axonaviation.com/commercial-aircraft/aircraft-data/aircraft-pricing",{"$f":"INDEX('Aircraft Pricing'!$A:$F,MATCH(A16&\"^\"&D16&\"^\"&E16&\"^\"&F16&\"^\"&G16,'Aircraft Pricing'!$F:$F,0),5)","v":"$219M"}]
["Airbus A350-900","A350-900","A350","ROLLS-ROYCE","8,100 NM",325,"$308.1M",308.10000000000002,{"$f":"INDEX(Sheet3!$A$1:$B$21,MATCH(RIGHT(A17,LEN(A17)-SEARCH(\" \",A17)),Sheet3!$A$1:$A$21,0),2)","v":{"$error":"#N/A"}},154.05000000000001,"http://www.axonaviation.com/commercial-aircraft/aircraft-data/aircraft-pricing",{"$f":"INDEX('Aircraft Pricing'!$A:$F,MATCH(A17&\"^\"&D17&\"^\"&E17&\"^\"&F17&\"^\"&G17,'Aircraft Pricing'!$F:$F,0),5)","v":"$308.1M"}]
["Airbus A350-1000","A350-1000","A350","ROLLS-ROYCE","7,950 NM",366,"$355.7M",355.7,{"$f":"INDEX(Sheet3!$A$1:$B$21,MATCH(RIGHT(A18,LEN(A18)-SEARCH(\" \",A18)),Sheet3!$A$1:$A$21,0),2)","v":{"$error":"#N/A"}},177.85,"http://www.axonaviation.com/commercial-aircraft/aircraft-data/aircraft-pricing",{"$f":"INDEX('Aircraft Pricing'!$A:$F,MATCH(A18&\"^\"&D18&\"^\"&E18&\"^\"&F18&\"^\"&G18,'Aircraft Pricing'!$F:$F,0),5)","v":"$355.7M"}]
["Airbus A380","A380","A380","ROLLS-ROYCE, Engine Alliance","8,200 NM",544,"$350M",350,{"$f":"INDEX(Sheet3!$A$1:$B$21,MATCH(RIGHT(A19,LEN(A19)-SEARCH(\" \",A19)),Sheet3!$A$1:$A$21,0),2)","v":{"$error":"#N/A"}},175,"http://www.axonaviation.com/commercial-aircraft/aircraft-data/aircraft-pricing",{"$f":"INDEX('Aircraft Pricing'!$A:$F,MATCH(A19&\"^\"&D19&\"^\"&E19&\"^\"&F19&\"^\"&G19,'Aircraft Pricing'!$F:$F,0),5)","v":"$350M"}]
["Boeing 737-700","737-700","737","Pratt & Whitney, GE","3,440 NM",126,"$89.1M",89.1,{"$f":"INDEX(Sheet3!$A$1:$B$21,MATCH(RIGHT(A20,LEN(A20)-SEARCH(\" \",A20)),Sheet3!$A$1:$A$21,0),2)","v":89.1},44.55,"http://www.axonaviation.com/commercial-aircraft/aircraft-data/aircraft-pricing",{"$f":"INDEX('Aircraft Pricing'!$A:$F,MATCH(A20&\"^\"&D20&\"^\"&E20&\"^\"&F20&\"^\"&G20,'Aircraft Pricing'!$F:$F,0),5)","v":"$89.1M"}]
{"$rows_left_out":26}
{"sheet":"Sheet3","index":1,"n_rows":21,"n_cols":2,"rows_kept":21,"cut":false,"hidden":false,"merged":[]}
["737-700",89.1]
["737 MAX 7",99.7]
["737-800",106.1]
["737-900ER",112.6]
["737 MAX 8",121.6]
["737 MAX 200",124.8]
["737 MAX 9",128.9]
["737 MAX 10",134.9]
["767-300ER",217.9]
["767-300 Freighter",220.3]
["787-8",248.3]
["787-9",292.5]
["777-200ER",306.60000000000002]
["787-10",338.4]
["777-200LR",346.9]
["777 Freighter",352.3]
["777-300ER",375.5]
["777-8",410.2]
["747-8",418.4]
["747-8 Freighter",419.2]
{"$rows_left_out":2}
{"sheet":"Sheet2","index":2,"n_rows":63,"n_cols":1,"rows_kept":63,"cut":false,"hidden":false,"merged":[]}
["A330/340"]
["A220"]
["A320"]
["A350"]
["A300"]
["A380"]
["ATR 42/72"]
["Do328Jet"]
["Beech 1900"]
["737"]
["777"]
["727"]
["787"]
["767"]
["747"]
["757"]
["717"]
["707/720"]
["DHC-8"]
["CRJ"]
{"$rows_left_out":44}
{"sheet":"Sheet4","index":3,"n_rows":327,"n_cols":14,"rows_kept":327,"cut":false,"hidden":false,"merged":[]}
[null,null,"MFGR",null,"aircraft_level_3","aircraft_level_4",null,null,null,null,null,"Price ($M)",null,"Source"]
[null,165,"Aermacchi",1,"M-345","Aermacchi M-345",{"$f":"TRIM(SUBSTITUTE(F2,C2,\"\"))","v":"M-345"},{"$f":"TRIM(SUBSTITUTE(G2,\"Family\",\"\"))","v":"M-345"},{"$f":"MATCH(\"*\"&E2&\"*\",Sheet1!C:C,0)","v":{"$error":"#N/A"}},{"$f":"MATCH(\"*\"&G2&\"*\",Sheet1!C:C,0)","v":{"$error":"#N/A"}},{"$f":"MATCH(\"*\"&H2&\"*\",Sheet1!B:B,0)","v":{"$error":"#N/A"}},{"$f":"338/13","v":26},null,"https://www.defensenews.com/digital-show-dailies/paris-air-show/2019/06/13/italy-buys-13-jet-trainers-inks-naval-industry-deal/"]
[null,166,"Aermacchi",1,"M-346","Aermacchi M-346",{"$f":"TRIM(SUBSTITUTE(F3,C3,\"\"))","v":"M-346"},{"$f":"TRIM(SUBSTITUTE(G3,\"Family\",\"\"))","v":"M-346"},{"$f":"MATCH(\"*\"&E3&\"*\",Sheet1!C:C,0)","v":{"$error":"#N/A"}},{"$f":"MATCH(\"*\"&G3&\"*\",Sheet1!C:C,0)","v":{"$error":"#N/A"}},{"$f":"MATCH(\"*\"&H3&\"*\",Sheet1!B:B,0)","v":{"$error":"#N/A"}},25,null,"https://www.defensenews.com/breaking-news/2017/01/26/trainer-price-wars-raytheon-wanted-millions-less-per-plane-than-leonardo/"]
[null,578,"Aero Vodochody",1,"Aero L-39NG","Aero Vodochody L-39NG","L-39NG","L-39NG",{"$f":"MATCH(\"*\"&E4&\"*\",Sheet1!C:C,0)","v":{"$error":"#N/A"}},{"$f":"MATCH(\"*\"&G4&\"*\",Sheet1!C:C,0)","v":{"$error":"#N/A"}},{"$f":"MATCH(\"*\"&H4&\"*\",Sheet1!B:B,0)","v":{"$error":"#N/A"}},18.5,null,"https://trends.aeroexpo.online/project-79261.html"]
[null,675,"AIDC",1,"AIDC T-5","AIDC T-5","T-5","T-5",{"$f":"MATCH(\"*\"&E5&\"*\",Sheet1!C:C,0)","v":{"$error":"#N/A"}},{"$f":"MATCH(\"*\"&G5&\"*\",Sheet1!C:C,0)","v":{"$error":"#N/A"}},{"$f":"MATCH(\"*\"&H5&\"*\",Sheet1!B:B,0)","v":{"$error":"#N/A"}},{"$f":"(2200000000/66)/1000000","v":33.333333333333329},null,"https://www.janes.com/osint-insights/defence-news/defence/aidc-completes-27-t-5a-deliveries-to-rocaf"]
[null,544,"Air",1,"Air Tractor","Air Tractor","Tractor","Tractor",{"$f":"MATCH(\"*\"&E6&\"*\",Sheet1!C:C,0)","v":{"$error":"#N/A"}},{"$f":"MATCH(\"*\"&G6&\"*\",Sheet1!C:C,0)","v":{"$error":"#N/A"}},{"$f":"MATCH(\"*\"&H6&\"*\",Sheet1!B:B,0)","v":{"$error":"#N/A"}},"x"]
[null,674,"Airbus",1,"ACJ","Airbus ACJ TwoTwenty","ACJ TwoTwenty","ACJ TwoTwenty",{"$f":"MATCH(\"*\"&E7&\"*\",Sheet1!C:C,0)","v":{"$error":"#N/A"}},{"$f":"MATCH(\"*\"&G7&\"*\",Sheet1!C:C,0)","v":{"$error":"#N/A"}},{"$f":"MATCH(\"*\"&H7&\"*\",Sheet1!B:B,0)","v":{"$error":"#N/A"}},100,null,"https://bjtonline.com/business-jet-news/airbus-acj-twotwenty"]
[null,296,"Airbus",1,"ACJ","Airbus ACJ320 Family","ACJ320 Family","ACJ320",{"$f":"MATCH(\"*\"&E8&\"*\",Sheet1!C:C,0)","v":{"$error":"#N/A"}},{"$f":"MATCH(\"*\"&G8&\"*\",Sheet1!C:C,0)","v":{"$error":"#N/A"}},{"$f":"MATCH(\"*\"&H8&\"*\",Sheet1!B:B,0)","v":{"$error":"#N/A"}},85,null,"https://www.bjtonline.com/aircraft/airbus-acj320"]
[null,528,"Airbus",1,"ACJ","Airbus ACJ320neo Family","ACJ320neo Family","ACJ320neo",{"$f":"MATCH(\"*\"&E9&\"*\",Sheet1!C:C,0)","v":{"$error":"#N/A"}},{"$f":"MATCH(\"*\"&G9&\"*\",Sheet1!C:C,0)","v":{"$error":"#N/A"}},{"$f":"MATCH(\"*\"&H9&\"*\",Sheet1!B:B,0)","v":{"$error":"#N/A"}},110,null,"https://finance.yahoo.com/news/5-priciest-private-jets-2023-185110930.html"]
[null,678,"Airbus",1,"Wide body VIP","Airbus ACJ330-200","ACJ330-200","ACJ330-200",{"$f":"MATCH(\"*\"&E10&\"*\",Sheet1!C:C,0)","v":{"$error":"#N/A"}},{"$f":"MATCH(\"*\"&G10&\"*\",Sheet1!C:C,0)","v":{"$error":"#N/A"}},{"$f":"MATCH(\"*\"&H10&\"*\",Sheet1!B:B,0)","v":{"$error":"#N/A"}},390,null,"https://www.businessairnews.com/hb_aircraftpage.html?recnum=ACJ330"]
[null,565,"Airbus",1,"A330","Airbus A330-743L Beluga XL","A330-743L Beluga XL","A330-743L Beluga XL",{"$f":"MATCH(\"*\"&E11&\"*\",Sheet1!C:C,0)","v":11},{"$f":"MATCH(\"*\"&G11&\"*\",Sheet1!C:C,0)","v":{"$error":"#N/A"}},{"$f":"MATCH(\"*\"&H11&\"*\",Sheet1!B:B,0)","v":{"$error":"#N/A"}},"x"]
[null,644,"Airbus",1,"A350","Airbus A350F","A350F","A350F",{"$f":"MATCH(\"*\"&E12&\"*\",Sheet1!C:C,0)","v":17},{"$f":"MATCH(\"*\"&G12&\"*\",Sheet1!C:C,0)","v":{"$error":"#N/A"}},{"$f":"MATCH(\"*\"&H12&\"*\",Sheet1!B:B,0)","v":{"$error":"#N/A"}},172,null,"https://aircargoeye.com/airline/aircraft/airbus/a350f/"]
[null,632,"Airbus",1,"A300","A300-600F/RF","A300-600F/RF","A300-600F/RF",{"$f":"MATCH(\"*\"&E13&\"*\",Sheet1!C:C,0)","v":{"$error":"#N/A"}},{"$f":"MATCH(\"*\"&G13&\"*\",Sheet1!C:C,0)","v":{"$error":"#N/A"}},{"$f":"MATCH(\"*\"&H13&\"*\",Sheet1!B:B,0)","v":{"$error":"#N/A"}},"OOP"]
[null,566,"Airbus",1,"A300","Airbus A300-600ST Beluga","A300-600ST Beluga","A300-600ST Beluga",{"$f":"MATCH(\"*\"&E14&\"*\",Sheet1!C:C,0)","v":{"$error":"#N/A"}},{"$f":"MATCH(\"*\"&G14&\"*\",Sheet1!C:C,0)","v":{"$error":"#N/A"}},{"$f":"MATCH(\"*\"&H14&\"*\",Sheet1!B:B,0)","v":{"$error":"#N/A"}},"x"]
[null,560,"Airbus",1,"A330","Airbus A330-200F","A330-200F","A330-200F",{"$f":"MATCH(\"*\"&E15&\"*\",Sheet1!C:C,0)","v":11},{"$f":"MATCH(\"*\"&G15&\"*\",Sheet1!C:C,0)","v":{"$error":"#N/A"}},{"$f":"MATCH(\"*\"&H15&\"*\",Sheet1!B:B,0)","v":12},{"$f":"INDEX(Sheet1!$A:$K,MATCH($H15,Sheet1!$B:$B,0),MATCH(L$1,Sheet1!$A$1:$K$1,0))","v":234.7},null,{"$f":"INDEX(Sheet1!$A:$K,MATCH($H15,Sheet1!$B:$B,0),MATCH(N$1,Sheet1!$A$1:$K$1,0))","v":"http://www.axonaviation.com/commercial-aircraft/aircraft-data/aircraft-pricing"}]
[null,562,"Airbus",1,"A330","Airbus A330-300P2F","A330-300P2F","A330-300P2F",{"$f":"MATCH(\"*\"&E16&\"*\",Sheet1!C:C,0)","v":11},{"$f":"MATCH(\"*\"&G16&\"*\",Sheet1!C:C,0)","v":{"$error":"#N/A"}},{"$f":"MATCH(\"*\"&H16&\"*\",Sheet1!B:B,0)","v":{"$error":"#N/A"}},27,"used","https://www.iba.aero/news/sustained-demand-for-passenger-to-freighter-aircraft-conversions-says-iba/"]
[null,669,"Airbus",1,"A340","Airbus A340-600NGF","A340-600NGF","A340-600NGF",{"$f":"MATCH(\"*\"&E17&\"*\",Sheet1!C:C,0)","v":{"$error":"#N/A"}},{"$f":"MATCH(\"*\"&G17&\"*\",Sheet1!C:C,0)","v":{"$error":"#N/A"}},{"$f":"MATCH(\"*\"&H17&\"*\",Sheet1!B:B,0)","v":{"$error":"#N/A"}},"x"]
[null,665,"Airbus",1,"A320ceo","A320-200P2F","A320-200P2F","A320-200P2F",{"$f":"MATCH(\"*\"&E18&\"*\",Sheet1!C:C,0)","v":{"$error":"#N/A"}},{"$f":"MATCH(\"*\"&G18&\"*\",Sheet1!C:C,0)","v":{"$error":"#N/A"}},{"$f":"MATCH(\"*\"&H18&\"*\",Sheet1!B:B,0)","v":{"$error":"#N/A"}},23.3,"used","https://www.airliners.net/forum/viewtopic.php?t=1439571&start=300"]
[null,666,"Airbus",1,"A320ceo","A321P2F","A321P2F","A321P2F",{"$f":"MATCH(\"*\"&E19&\"*\",Sheet1!C:C,0)","v":{"$error":"#N/A"}},{"$f":"MATCH(\"*\"&G19&\"*\",Sheet1!C:C,0)","v":{"$error":"#N/A"}},{"$f":"MATCH(\"*\"&H19&\"*\",Sheet1!B:B,0)","v":{"$error":"#N/A"}},101,null,"https://www.avdelphi.com/aircraft_type.html?id=12714&recache=1721917906"]
[null,104,"Airbus",1,"Tiger","Airbus Tiger","Tiger","Tiger",{"$f":"MATCH(\"*\"&E20&\"*\",Sheet1!C:C,0)","v":{"$error":"#N/A"}},{"$f":"MATCH(\"*\"&G20&\"*\",Sheet1!C:C,0)","v":{"$error":"#N/A"}},{"$f":"MATCH(\"*\"&H20&\"*\",Sheet1!B:B,0)","v":{"$error":"#N/A"}},73,null,"https://simpleflying.com/most-expensive-military-helicopters-guide/"]
{"$rows_left_out":308}
{"sheet":"airbus 2018","index":4,"n_rows":20,"n_cols":2,"rows_kept":20,"cut":false,"hidden":false,"merged":[]}
["AIRBUS AIRCRAFT"]
["2018 AVERAGE LIST PRICES* (USD millions)"]
["A318",77.400000000000006]
["A319",92.3]
["A320",101]
["A321",118.3]
["A319neo",101.5]
["A320neo",110.6]
["A321neo",129.5]
["A330-200",238.5]
["A330-800 (neo)",259.89999999999998]
["A330-200 Freighter",241.7]
["A330-300",264.2]
["A330-900 (neo)",296.39999999999998]
["A350-800",280.60000000000002]
["A350-900",317.39999999999998]
["A350-1000",366.5]
["A380",445.6]
[]
["https://www.airbus.com/sites/g/files/jlcbta136/files/2021-07/new-airbus-list-prices-2018.pdf"]
{"$rows_left_out":1}
{"sheet":"statista 2021","index":5,"n_rows":18,"n_cols":2,"rows_kept":18,"cut":false,"hidden":false,"merged":[]}
["New production values for Airbus aircraft in 2021, by type"]
["A380",169.5]
["A350-1000",159.1]
["A350-900",145.80000000000001]
["A330neo-900",104]
["A330-800",92.2]
["A330-200 Freighter",84]
["A330-300",80.599999999999994]
["A330-200 Freighter",72.400000000000006]
["A321neo",54.5]
["A320neo",49.2]
["A321ceo",48.5]
["A320ceo",41.5]
["A220-300",36.799999999999997]
["A319neo",36.700000000000003]
["A220-100",32.6]
[]
["https://www.statista.com/statistics/273962/prices-of-airbus-aircraft-by-type/"]

{"sheet":"Aircraft Pricing","index":6,"n_rows":41,"n_cols":6,"rows_kept":41,"cut":false,"hidden":false,"merged":[]}
["Aircraft model","Engine","Range","Typical Configuration","New Price"]
["BOEING 737 MAX 7",null,null,172,"$99.7M",{"$f":"A2&\"^\"&B2&\"^\"&C2&\"^\"&D2&\"^\"&E2","v":"BOEING 737 MAX 7^^^172^$99.7M"}]
["Airbus A318","GE, Pratt & Whitney","3,100 NM",107,"$75.1M",{"$f":"A3&\"^\"&B3&\"^\"&C3&\"^\"&D3&\"^\"&E3","v":"Airbus A318^GE, Pratt & Whitney^3,100 NM^107^$75.1M"}]
["Airbus A319","GE, International Aero Engines","3,700 nm",124,"$89.6M","Airbus A319^GE, International Aero Engines^3,700 nm^124^$89.6M"]
["Airbus A320","GE, International Aero Engines","3,300 NM",150,"$98M","Airbus A320^GE, International Aero Engines^3,300 NM^150^$98M"]
["Airbus A321","GE, International Aero Engines","3,200 NM",185,"$114.9M","Airbus A321^GE, International Aero Engines^3,200 NM^185^$114.9M"]
["Airbus A330-200","ROLLS-ROYCE, GE, Pratt & Whitney","7,250 NM",247,"$231.5M","Airbus A330-200^ROLLS-ROYCE, GE, Pratt & Whitney^7,250 NM^247^$231.5M"]
["Airbus A330-200F","Pratt & Whitney, ROLLS-ROYCE","4,000 NM","N/A","$234.7M","Airbus A330-200F^Pratt & Whitney, ROLLS-ROYCE^4,000 NM^N/A^$234.7M"]
["Airbus A330-300","ROLLS-ROYCE, GE, Pratt & Whitney","6,350 NM",277,"$256.4M","Airbus A330-300^ROLLS-ROYCE, GE, Pratt & Whitney^6,350 NM^277^$256.4M"]
["Airbus A340-300","CFM International","7,300 NM",277,"$219M","Airbus A340-300^CFM International^7,300 NM^277^$219M"]
["Airbus A350-900","ROLLS-ROYCE","8,100 NM",325,"$308.1M","Airbus A350-900^ROLLS-ROYCE^8,100 NM^325^$308.1M"]
["Airbus A350-1000","ROLLS-ROYCE","7,950 NM",366,"$355.7M","Airbus A350-1000^ROLLS-ROYCE^7,950 NM^366^$355.7M"]
["Airbus A380","ROLLS-ROYCE, Engine Alliance","8,200 NM",544,"$350M","Airbus A380^ROLLS-ROYCE, Engine Alliance^8,200 NM^544^$350M"]
["Boeing 737-700","Pratt & Whitney, GE","3,440 NM",126,"$89.1M","Boeing 737-700^Pratt & Whitney, GE^3,440 NM^126^$89.1M"]
["Boeing 737-800","Pratt & Whitney, GE, ROLLS-ROYCE","3,115 NM",162,"$106.1M","Boeing 737-800^Pratt & Whitney, GE, ROLLS-ROYCE^3,115 NM^162^$106.1M"]
["Boeing 737-900ER","Pratt & Whitney, GE","3,265 NM",178,"$112.6M","Boeing 737-900ER^Pratt & Whitney, GE^3,265 NM^178^$112.6M"]
["Boeing 747-400","Pratt & Whitney, GE, ROLLS-ROYCE","7,260 NM",410,null,"Boeing 747-400^Pratt & Whitney, GE, ROLLS-ROYCE^7,260 NM^410^"]
["Boeing 747-400F","Pratt & Whitney, GE, ROLLS-ROYCE","4,445 NM","N/A",null,"Boeing 747-400F^Pratt & Whitney, GE, ROLLS-ROYCE^4,445 NM^N/A^"]
["Boeing 747-8i","GE","7,730 NM",410,"$418.4M","Boeing 747-8i^GE^7,730 NM^410^$418.4M"]
["Boeing 757-200","ROLLS-ROYCE, Pratt & Whitney","4,100 NM",200,"TBC","Boeing 757-200^ROLLS-ROYCE, Pratt & Whitney^4,100 NM^200^TBC"]
{"$rows_left_out":21}